[NLUUG]   Welcome to ftp.nluug.nl
Current directory: /ftp/ftp/pub/ftp/vim/patches/8.2/
 
Current bandwidth utilization 1172.42 Mbit/s
Bandwidth utilization bar
Contents of README:
Patches for Vim - Vi IMproved 8.2

The files in this directory contain source code changes to fix problems
in a released version of Vim.  Each file also contains an explanation of
the problem that is fixed, like the message that was sent to the vim-dev
maillist.

The best is to apply the patches in sequence.  This avoids problems when
a patch depends on a previous patch. 

Before patching, change to the top Vim directory, where the "src" and
"runtime" directories are located.
Depending on the version of "patch" that you use, you may have add an
argument to make it patch the right file:
        patch -p < 8.2.0001
        patch -p0 < 8.2.0001

After applying a patch, you need to compile Vim.  There are no patches
for binaries.

Checksums for the patch files can be found in the file MD5SUMS.


Individual patches for Vim 8.2:

  SIZE  NAME      FIXES
  1549  8.2.0001  #endif comments do not reflect corresponding #ifdef
  2457  8.2.0002  "dj" only deletes first line of closed fold
 16851  8.2.0003  Build file dependencies are incomplete
 16584  8.2.0004  get E685 and E931 if buffer reload is interrupted
  4131  8.2.0005  duplication in version info
  1891  8.2.0006  test using long file name may fail
  4669  8.2.0007  popup menu positioned wrong with folding in two tabs
 11490  8.2.0008  test72 is old style
  3996  8.2.0009  VMS: terminal version doesn't build
 88183  8.2.0010  test64 is old style
  5133  8.2.0011  screen updating wrong when opening preview window
  3423  8.2.0012  some undo functionality is not tested
 17191  8.2.0013  not using a typedef for condstack
 27932  8.2.0014  test69 and test95 are old style
  4754  8.2.0015  not all modeline variants are tested
  1758  8.2.0016  test name used twice, option not restored properly
 48904  8.2.0017  OS/2 and MS-DOS are still mentioned
  2620  8.2.0018  :join does not add white space where it should
  2951  8.2.0019  cannot get number of lines of another buffer
 15312  8.2.0020  mouse clicks in the command line not tested
  3528  8.2.0021  timer test fails too often on Travis with MacOS
  2040  8.2.0022  click in popup window doesn't close it in the GUI
  8371  8.2.0023  command line editing not sufficiently tested
  2104  8.2.0024  filetype Rego not recognized
  1743  8.2.0025  repeated word in comment
292321  8.2.0026  still some /* */ comments
 21092  8.2.0027  still some /* */ comments
  9858  8.2.0028  searchpairpos() is not tested
  3228  8.2.0029  MS-Windows: crash with empty job command
  3988  8.2.0030  "gF" does not work on output of "verbose command"
  2535  8.2.0031  MS-Windows: test for empty job fails
  2887  8.2.0032  MS-Windows: test for blank job fails
  1890  8.2.0033  crash when make_extmatch() runs out of memory
  1798  8.2.0034  missing check for out of memory
 18917  8.2.0035  saving and restoring called_emsg is clumsy
  3171  8.2.0036  not enough test coverage for match functions
  1470  8.2.0037  missing renamed message
  7827  8.2.0038  spell suggestions insufficiently tested
  2696  8.2.0039  memory access error when "z=" has no suggestions
  1763  8.2.0040  timers test is still flaky on Travis for Mac
  2338  8.2.0041  leaking memory when selecting spell suggestion
  1903  8.2.0042  clearing funccal values twice
  1847  8.2.0043  timers test is still flaky on Travis for Mac
 16697  8.2.0044  expression type is used inconsistently
  5301  8.2.0045  script test fails
  9537  8.2.0046  tests for spell suggestions are slow
  6978  8.2.0047  cannot skip tests for specific MS-Windows platform
  1795  8.2.0048  another timers test is flaky on Travis for Mac
  6632  8.2.0049  command line completion not fully tested
  3813  8.2.0050  after deleting a file mark it is still in viminfo
  1913  8.2.0051  command line completion test skipped
  5964  8.2.0052  more-prompt not properly tested
  2507  8.2.0053  windowsversion() does not always return the right value
  6617  8.2.0054  :diffget and :diffput don't have good completion
  2339  8.2.0055  cannot use ":gui" in vimrc with VIMDLL enabled
 62363  8.2.0056  execution stack is incomplete and inefficient
  2705  8.2.0057  cannot build with small features
  1792  8.2.0058  running tests changes ~/.viminfo
  1790  8.2.0059  compiler warnings for unused variables in small build
  2342  8.2.0060  message test only runs with one encoding
  1992  8.2.0061  the execute stack can grow big and never shrinks
  1670  8.2.0062  memory test is flaky on FreeBSD
  1725  8.2.0063  wrong size argument to vim_snprintf()
  6388  8.2.0064  diffmode completion doesn't use per-window setting
  4026  8.2.0065  Amiga and alikes: autoopen only used on Amiga OS4
  7675  8.2.0066  some corners of vim_snprintf() are not tested
 11234  8.2.0067  ERROR_UNKNOWN clashes on some systems
  2106  8.2.0068  crash when using Python 3 with "utf32" encoding
 15191  8.2.0069  ETYPE_ is used for two different enums
  2157  8.2.0070  crash when using Python 3 with "debug" encoding
  2547  8.2.0071  memory test often fails on Cirrus CI
  1636  8.2.0072  memory test still fails on Cirrus CI
  5381  8.2.0073  initializing globals with COMMA is clumsy
  4069  8.2.0074  Python 3 unicode test sometimes fails
  1718  8.2.0075  Python 3 unicode test still sometimes fails
  1723  8.2.0076  Python 3 unicode test fails on MS-Windows
  6570  8.2.0077  settagstack() cannot truncate at current index
  2748  8.2.0078  expanding <sfile> works differently the second time
  1522  8.2.0079  Python 3 unicode test still fails on MS-Windows
  4043  8.2.0080  globals using INIT4() are not in the tags file
  2087  8.2.0081  MS-Windows also need the change to support INIT4()
  2490  8.2.0082  when reusing a buffer listeners are not cleared
  4166  8.2.0083  text properties wrong when tabs and spaces are exchanged
 19804  8.2.0084  complete item "user_data" can only be a string
  3918  8.2.0085  dead code in builtin functions
  2720  8.2.0086  build error for small version
  4305  8.2.0087  crash in command line expansion when out of memory
 16660  8.2.0088  insufficient tests for tags; bug in using extra tag field
  1929  8.2.0089  crash when running out of memory in :setfiletype completion
  1620  8.2.0090  generated files show up in git status
  1869  8.2.0091  compiler warnings for size_t / int types
  8314  8.2.0092  tags functionality insufficiently tested
  2283  8.2.0093  win_splitmove() can make Vim hang
  1516  8.2.0094  MS-Windows: cannot build with Strawberry Perl 5.30
  4518  8.2.0095  cannot specify exit code for :cquit
 13631  8.2.0096  cannot create tiny popup window in last column
  2839  8.2.0097  crash with autocommand and spellfile
  9421  8.2.0098  exe stack length can be wrong without being detected
  2308  8.2.0099  use of NULL pointer when out of memory
 33959  8.2.0100  macros for Ruby are too complicated
  2370  8.2.0101  crash when passing null object to ":echomsg"
  1640  8.2.0102  messages test fails in small version
  3930  8.2.0103  using null object with execute() has strange effects
  2581  8.2.0104  using channel or job with ":execute" has strange effects
  6703  8.2.0105  Vim license not easy to find on github
  8812  8.2.0106  printf formats are not exactly right
  1594  8.2.0107  hgignore is out of sync from gitignore
  5148  8.2.0108  when sign text is changed a manual redraw is needed
  5565  8.2.0109  corrupted text properties when expanding spaces
 16846  8.2.0110  prop_find() is not implemented
 22059  8.2.0111  VAR_SPECIAL is also used for booleans
  2242  8.2.0112  illegal memory access when using 'cindent'
  3850  8.2.0113  "make cmdidxs" fails
  9974  8.2.0114  info about sourced scripts is scattered
  5139  8.2.0115  byte2line() does not work correctly with text properties
  4725  8.2.0116  BufEnter autocmd not triggered on ":tab drop"
  2345  8.2.0117  crash when using gettabwinvar() with invalid arguments
  5488  8.2.0118  crash when cycling to buffers involving popup window 
  1817  8.2.0119  message test fails on some platforms
  4225  8.2.0120  virtcol() does not check arguments to be valid
  4274  8.2.0121  filter() and map() on blob don't work
  8376  8.2.0122  readme files still mention MS-DOS
  4034  8.2.0123  complete_info() does not work when CompleteDone is triggered
  1979  8.2.0124  compiler warnings for variable types
  6470  8.2.0125  :mode no longer works for any system
  1594  8.2.0126  textprop test fails
  3187  8.2.0127  some buffer commands work in a popup window
 12194  8.2.0128  cannot list options one per line
  4494  8.2.0129  MS-Windows installer doesn't use Turkish translations
  2939  8.2.0130  Python3 ranges are not tested
  4110  8.2.0131  command line is not cleared when switching tabs
  3176  8.2.0132  script may be re-used when deleting and creating a new one
  2427  8.2.0133  invalid memory access with search command
  4359  8.2.0134  some map functionality not covered by tests
  2303  8.2.0135  bracketed paste can still cause invalid memory access
  1801  8.2.0136  stray ch_logfile() call
  3314  8.2.0137  crash when using win_execute() from a new tab
  2260  8.2.0138  memory leak when starting a job fails
  2015  8.2.0139  MS-Windows: default for IME is inconsistent
  9953  8.2.0140  CI does not test building doc tags
  2689  8.2.0141  no swift filetype detection
  5532  8.2.0142  possible to enter popup window with CTRL-W p
  1694  8.2.0143  Coverity warning for possible use of NULL pointer
 12830  8.2.0144  some mapping code is not fully tested
  2733  8.2.0145  using #error for compilation errors should be OK now
  3285  8.2.0146  wrong indent when 'showbreak' and 'breakindent' are set
  4848  8.2.0147  block Visual mode operators not correct when 'linebreak' set
  8058  8.2.0148  mapping related function in wrong source file
546902  8.2.0149  maintaining a Vim9 branch separately is more work
  2924  8.2.0150  cannot define python function when using :execute
  5948  8.2.0151  detecting a script was already sourced is unreliable
  2328  8.2.0152  restoring ctrl_x_mode is not needed
  2128  8.2.0153  warning shows when listing version info
 21204  8.2.0154  reallocating the list of scripts is inefficient
  5718  8.2.0155  warnings from MinGW compiler; tests fail without +float
 35557  8.2.0156  various typos in source files and tests
  1822  8.2.0157  Vim9 script files not in list of distributed files
  8411  8.2.0158  triggering CompleteDone earlier is not backwards compatible
 19352  8.2.0159  non-materialized range() list causes problems
  1989  8.2.0160  range test fails
  2619  8.2.0161  not recognizing .gv file as dot filetype
  1730  8.2.0162  balloon test fails in the GUI
  2779  8.2.0163  test hangs on MS-Windows console
  6803  8.2.0164  test_alot takes too long
  1586  8.2.0165  Coverity warning for using NULL pointer
  1738  8.2.0166  Coverity warning for using uninitialized variable
  2056  8.2.0167  Coverity warning for ignoring return value
  1918  8.2.0168  Coverity warning for assigning NULL to an option
  1546  8.2.0169  Coverity warning for dead code
  2419  8.2.0170  Coverity warning for ignoring return value
  1566  8.2.0171  Coverity warning for using uninitialized buffer
  1958  8.2.0172  Coverity warning for not restoring character
 28537  8.2.0173  build fails with old compiler
 15856  8.2.0174  various commands not completely tested
  2955  8.2.0175  crash when removing list element in map()
  1429  8.2.0176  generating os headers does not work for Swedish
  1548  8.2.0177  memory leak in get_tags()
  4310  8.2.0178  with VTP the screen may not be restored properly
 17652  8.2.0179  still a few places where range() does not work
  1720  8.2.0180  test for wrapmargin fails if terminal is not 80 columns
 17654  8.2.0181  problems parsing :term arguments
  2252  8.2.0182  min() and max() materialize a range() list
 60266  8.2.0183  tests fail when the float feature is disabled
  1590  8.2.0184  blob test fails
 16105  8.2.0185  Vim9 script: cannot use "if has()" to skip lines
  2393  8.2.0186  a couple of tests may fail when features are missing
  1850  8.2.0187  reduntant code
  8482  8.2.0188  Check commands don't work well with Vim9 script
  2087  8.2.0189  cd() with NULL argument crashes
  2564  8.2.0190  Kotlin files are not recognized
 31598  8.2.0191  cannot put a terminal in a popup window
  3621  8.2.0192  build failure without +terminal feature
  1938  8.2.0193  still build failure without +terminal feature
 10759  8.2.0194  some commands can cause problems in terminal popup
  2900  8.2.0195  some tests fail when run in the GUI
  5288  8.2.0196  blocking commands for a finished job in a popup window
 10593  8.2.0197  some Ex commands not sufficiently tested
  3151  8.2.0198  no tests for y/n prompt
  5865  8.2.0199  Vim9 script commands not sufficiently tested
 26806  8.2.0200  Vim9 script commands not sufficiently tested
 18634  8.2.0201  cannot assign to an imported variable
  1417  8.2.0202  when 'lazyredraw' is set the window title may not be updated
 11345  8.2.0203  :helptags and some other functionality not tested
  3391  8.2.0204  crash when using winnr('j') in a popup window
  2126  8.2.0205  error code E899 used twice
  4162  8.2.0206  calling Vim9 function using default argument fails
  4686  8.2.0207  crash when missing member type on list argument
  6927  8.2.0208  fnamemodify() does not apply ":~" when followed by ":."
  4772  8.2.0209  function a bit far away from where it's used
  1736  8.2.0210  Coverity complains about uninitialized field
  2762  8.2.0211  test for ANSI colors fails without an "ls" command
 10146  8.2.0212  missing search/substitute pattern hardly tested
  3497  8.2.0213  configure does not recognize gcc 10.0 and later
  4637  8.2.0214  a popup window with a terminal can be made hidden
  2675  8.2.0215  wrong file name shortening
  5306  8.2.0216  several Vim9 instructions are not tested
  1817  8.2.0217  terminal test fails on Mac
  6678  8.2.0218  several Vim9 instructions are not tested
  2103  8.2.0219  terminal test still fails on Mac
  2078  8.2.0220  terminal test did pass on Mac
  3281  8.2.0221  no test for Vim9 += and ..=
 16301  8.2.0222  Vim9: optional function arguments don't work yet
 19305  8.2.0223  some instructions not yet tested
  5603  8.2.0224  compiling :elseif not tested yet
  4828  8.2.0225  compiling lambda not tested yet
  3825  8.2.0226  compiling for loop not tested
  3870  8.2.0227  compiling a few instructions not tested
  2846  8.2.0228  configure does not recognize gcc version on BSD
 11790  8.2.0229  compare instructions not tested
  1806  8.2.0230  terminal popup test is flaky
  1961  8.2.0231  silent system command may clear the screen
  2709  8.2.0232  the :compiler command causes a crash
 12940  8.2.0233  crash when using garbagecollect() in between rand()
  2512  8.2.0234  message test fails on SunOS
  2936  8.2.0235  draw error when an empty group is removed from 'statusline'
  1768  8.2.0236  MS-Windows uninstall doesn't delete vimtutur.bat
  2231  8.2.0237  crash when setting 'wincolor' on finished terminal window
  2798  8.2.0238  MS-Windows: job_stop() results in exit value zero
  3106  8.2.0239  MS-Windows: 'env' job option does not override existing vars
  3881  8.2.0240  using memory after it was freed
  2064  8.2.0241  crash when setting 'buftype' to "quickfix"
  2147  8.2.0242  preview popup window test fails with long directory name
 22438  8.2.0243  insufficient code coverage for ex_docmd.c functions
  1994  8.2.0244  compiler warning in Lua interface
  1725  8.2.0245  MSVC: error message if the auto directory already exists
  5304  8.2.0246  MSVC: deprecation warnings with Ruby
  1808  8.2.0247  misleading comment in NSIS installer script
  5569  8.2.0248  MS-Windows: dealing with deprecation is too complicated
  2652  8.2.0249  MS-Windows: various warnings
  7215  8.2.0250  test_clear_search_pat() is unused
  4121  8.2.0251  a couple of function return types can be more specific
  2092  8.2.0252  Windows compiler warns for using size_t
  3477  8.2.0253  crash when using :disassamble without argument
  1763  8.2.0254  compiler warning for checking size_t to be negative
  2635  8.2.0255  VMS: missing files in build
 68712  8.2.0256  time and timer related code is spread out
  8540  8.2.0257  cannot recognize a terminal in a popup window
  6070  8.2.0258  modifyOtherKeys cannot be temporarily disabled
  2932  8.2.0259  terminal in popup test sometimes fails
 16546  8.2.0260  several lines of code are duplicated
 10871  8.2.0261  some code not covered by tests
  1617  8.2.0262  fileformat test fails on MS-Windows
  3205  8.2.0263  a few new Vim9 messages are not localized
  1845  8.2.0264  fileformat test still fails on MS-Windows
  1949  8.2.0265  "eval" after "if 0" doesn't check for following command
  1437  8.2.0266  terminal in popup test sometimes fails on Mac
  2107  8.2.0267  no check for a following cmd when calling a function fails
  1697  8.2.0268  trycatch test fails
  2877  8.2.0269  Vim9: operator after list index does not work
 24105  8.2.0270  some code not covered by tests
 14835  8.2.0271  the "num64" feature is available everywhere
  5481  8.2.0272  ":helptags ALL" gives error for some directories
  3732  8.2.0273  MS-Windows uninstall may delete wrong batch file
  2875  8.2.0274  hang with combination of feedkeys(), Ex mode and :global
  8120  8.2.0275  some Ex code not covered by tests
  3469  8.2.0276  Vim9: not allowing space before ")" in function call
  5067  8.2.0277  Vim9: not all instructions covered by tests
  1932  8.2.0278  channel test is flaky on Mac
  2150  8.2.0279  Vim9: no test for deleted :def function
  2155  8.2.0280  Vim9: throw in :def function not caught higher up
  4844  8.2.0281  two placed signs in the same line are not combined
  4136  8.2.0282  Vim9: setting number option not tested
  3668  8.2.0283  Vim9: failing to load script var not tested
  1579  8.2.0284  Vim9: assignment test fails
  6719  8.2.0285  unused error message; cannot create s:var
  7325  8.2.0286  cannot use popup_close() for a terminal popup
  2925  8.2.0287  Vim9: return in try block not tested; catch not tested
  8199  8.2.0288  Vim9: some float and blob operators not tested
  1390  8.2.0289  Vim9: :echo did not clear the rest of the line
  2419  8.2.0290  running individual test differs from all tests
  7996  8.2.0291  Vim9: assigning [] to list<string> doesn't work
  2267  8.2.0292  Vim9: CHECKNR and CHECKTYPE instructions not tested
 14618  8.2.0293  various Ex commands not sufficiently tested
 13597  8.2.0294  cannot use Ex command that is also a function name
 17226  8.2.0295  highlighting for :s wrong when using different separator
 19909  8.2.0296  mixing up "long long" and __int64 may cause problems
  2148  8.2.0297  compiler warnings for the Ruby interface
  5679  8.2.0298  Vim9 script: cannot start command with a string constant
  5897  8.2.0299  Vim9: ISN_STORE with argument not tested
  1754  8.2.0300  Vim9: expression test fails without channel support
  8193  8.2.0301  insufficient testing for exception handling
  3046  8.2.0302  setting 'term' may cause error in TermChanged autocommand
  1422  8.2.0303  TermChanged test fails in the GUI
  1878  8.2.0304  terminal test if failing on some systems
  3421  8.2.0305  relativenumber test fails on some systems
  2909  8.2.0306  Vim9: :substitute(pat(repl does not work in Vim9 script
  3011  8.2.0307  Python 3 vim.eval not well tested
  2565  8.2.0308  'showbreak' does not work for a very long line
  5888  8.2.0309  window-local values have confusing name
  2827  8.2.0310  autocmd test fails on a slow system
  2598  8.2.0311  Vim9: insufficient script tests
 12101  8.2.0312  Vim9: insufficient script tests
  5539  8.2.0313  Vim9: insufficient script tests
  1854  8.2.0314  short name not set for terminal buffer
  2997  8.2.0315  build failure on HP-UX system
  9089  8.2.0316  ex_getln.c code has insufficient test coverage
  1884  8.2.0317  MSVC: _CRT_SECURE_NO_DEPRECATE not defined on DEBUG build
  4475  8.2.0318  Vim9: types not sufficiently tested
  3544  8.2.0319  file missing in distribution, comments outdated
222244  8.2.0320  no Haiku support
  8639  8.2.0321  Vim9: ":execute" does not work yet
  5701  8.2.0322  Vim9: error checks not tested
  8478  8.2.0323  Vim9: calling a function that is defined later is slow
  8788  8.2.0324  text property not updated correctly when inserting/deleting
 10818  8.2.0325  ex_getln.c code not covered by tests
  1788  8.2.0326  compiler warning for using uninitialized variable
  2981  8.2.0327  crash when opening and closing two popup terminal windows
 15040  8.2.0328  no redraw when leaving term-normal mode in popup terminal
  3708  8.2.0329  popup filter converts 0x80 bytes
  1381  8.2.0330  build error with popup window but without terminal
  3220  8.2.0331  internal error when using test_void() and test_unknown()
  4519  8.2.0332  some code in ex_getln.c not covered by tests
  3982  8.2.0333  terminal in popup test is flaky
  6119  8.2.0334  abort called when using test_void()
  4242  8.2.0335  no completion for :disassemble
 12094  8.2.0336  Vim9: insufficient test coverage for compiling
  1555  8.2.0337  build fails on a few systems
  1477  8.2.0338  build failure without the channel feature
 74311  8.2.0339  Vim9: function return type may depend on arguments
  5078  8.2.0340  Vim9: function and partial types not tested
  3144  8.2.0341  using ":for" in Vim9 script gives an error
  5710  8.2.0342  some code in ex_getln.c not covered by tests
  4773  8.2.0343  Vim9: using wrong instruction, limited test coverage
  1480  8.2.0344  ":def" not skipped properly
  1500  8.2.0345  compiler warning when building without the float feature
  7931  8.2.0346  Vim9: finding common list type not tested
 10476  8.2.0347  various code not covered by tests
 10799  8.2.0348  Vim9: not all code tested
  3030  8.2.0349  Vim9: constant expression not well tested
 22031  8.2.0350  Vim9: expression tests don't use recognized constants
  1512  8.2.0351  terminal in popup test is still a bit flaky
  4177  8.2.0352  FreeBSD: test for sourcing utf-8 is skipped
  2687  8.2.0353  Vim9: while loop not tested
  1469  8.2.0354  Python 3.9 does not define _Py_DEC_REFTOTAL
  4404  8.2.0355  Vim9: str_val is confusing, it's a number
  6740  8.2.0356  MS-Windows: feedkeys() with VIMDLL cannot handle CSI
  4030  8.2.0357  cannot delete a text property matching both id and type
  8982  8.2.0358  insufficient testing for indent.c
  2237  8.2.0359  popup_atcursor() may hang
  1942  8.2.0360  yaml files are only recognized by the file extension
  3125  8.2.0361  internal error when using "0" for a callback
  2175  8.2.0362  MS-Windows: channel test fails if grep is not available
 22535  8.2.0363  some Normal mode commands not tested
  2530  8.2.0364  printf test failing on Haiku
  4851  8.2.0365  tag kind can't be a multi-byte character
  7335  8.2.0366  hardcopy command not tested enough
  2149  8.2.0367  can use :pedit in a popup window
  7477  8.2.0368  Vim9: import that redefines local variable does not fail
 34492  8.2.0369  various Normal mode commands not fully tested
  2417  8.2.0370  the typebuf_was_filled flag is sometimes not reset
  6732  8.2.0371  crash with combination of terminal popup and autocmd
  4466  8.2.0372  prop_find() may not find text property at start of the line
  2526  8.2.0373  type of term_sendkeys() is unknown
  1534  8.2.0374  using wrong printf directive for jump location
  3338  8.2.0375  Coverity warning for not using return value
  1462  8.2.0376  nasty callback test fails on some systems
  2933  8.2.0377  no CI test for a big-endian system
  2701  8.2.0378  prop_find() does not find all props
  1792  8.2.0379  gcc warns for ambiguous else
  5731  8.2.0380  tiny popup when creating a terminal popup without minwidth
  2771  8.2.0381  using freed memory with :lvimgrep and autocommand
 11662  8.2.0382  some tests fail when run under valgrind
  1593  8.2.0383  wrong feature check causes test not to be run
  3707  8.2.0384  Travis CI has warnings
 38895  8.2.0385  menu functionality insufficiently tested
  1773  8.2.0386  part from unfinished patch got included
  2338  8.2.0387  error for possible NULL argument to qsort()
  6692  8.2.0388  printmbcharset option not tested
  1597  8.2.0389  delayed redraw when shifting text from Insert mode
  6796  8.2.0390  terminal postponed scrollback test is flaky
  2615  8.2.0391  CI test coverage dropped
  3116  8.2.0392  Coverity warns for using array index out of range
  2211  8.2.0393  Coverity warns for not using return value
  1671  8.2.0394  Coverity complains about using NULL pointer
  1833  8.2.0395  build fails with FEAT_EVAL but without FEAT_MENU
 12909  8.2.0396  cmdexpand.c insufficiently tested
  2502  8.2.0397  delayed screen update when using undo from Insert mode
  5040  8.2.0398  profile test fails when two functions take same time
  4842  8.2.0399  various memory leaks
  4248  8.2.0400  not all tests using a terminal are in the list of flaky tests
 17132  8.2.0401  not enough test coverage for evalvars.c
  3478  8.2.0402  setting local instead of global flag
  2868  8.2.0403  when 'buftype' is "nofile" there is no overwrite check
  2048  8.2.0404  writefile() error does not give a hint
  3073  8.2.0405  MSVC: build fails with some combination of features
  2253  8.2.0406  FileReadCmd event not well tested
  4043  8.2.0407  no early check if :find and :sfind have an argument
  1381  8.2.0408  delete() commented out for testing
 13412  8.2.0409  search test leaves file behind
  2012  8.2.0410  channel test fails too often on slow Mac
  1822  8.2.0411  Mac: breakcheck is using a value from the stone ages
  2909  8.2.0412  MS-Windows: cannot use vimtutor from the start menu
 20994  8.2.0413  buffer menu does not handle special buffers properly
  5532  8.2.0414  channel connect_waittime() test is flaky
  3208  8.2.0415  bsdl filetype is not detected
  1592  8.2.0416  test leaves file behind
  8668  8.2.0417  Travis CI config can be improved
 20647  8.2.0418  code in eval.c not sufficiently covered by tests
 18711  8.2.0419  various memory leaks in Vim9 script code
  3066  8.2.0420  Vim9: cannot interrupt a loop with CTRL-C
  4020  8.2.0421  interrupting with CTRL-C does not always work
  2571  8.2.0422  crash when passing popup window to win_splitmove()
  5553  8.2.0423  in some environments a few tests are expected to fail
  2485  8.2.0424  checking for wrong return value
 51025  8.2.0425  code for modeless selection not sufficiently tested
  5649  8.2.0426  some errors were not tested for
 37995  8.2.0427  it is not possible to check for a typo in a feature name
  2844  8.2.0428  buffer name may leak
  1567  8.2.0429  no warning when test checks for option that never exists
  5262  8.2.0430  window creation failure not properly tested
  1993  8.2.0431  some compilers don't support using \e for Esc
  6156  8.2.0432  a few tests fail in a huge terminal
  5088  8.2.0433  INT signal not properly tested
  1453  8.2.0434  MS-Windows with VTP: Normal color not working
  2069  8.2.0435  channel contents might be freed twice
 13442  8.2.0436  no warnings for incorrect printf arguments
  6700  8.2.0437  MS-Windows installer contains old stuff
  2671  8.2.0438  terminal noblock test is very flaky on BSD
  5108  8.2.0439  :disassemble has minor flaws
  3341  8.2.0440  terminal noblock test is still very flaky on BSD
  2913  8.2.0441  terminal noblock test is still failing on BSD
  2756  8.2.0442  channel contents might be used after being freed
138665  8.2.0443  clipboard code is spread out
  3318  8.2.0444  swap file test fails on some systems
  2354  8.2.0445  png and xpm files not in MS-Windows zip file
  2469  8.2.0446  listener with undo of deleting all lines not tested
  2376  8.2.0447  terminal scroll tests fails on some systems
 24985  8.2.0448  various functions not properly tested
  3011  8.2.0449  Vim9: crash if return type is invalid
 11029  8.2.0450  not enough testing for restricted mode and function calls
  1616  8.2.0451  Win32: double-width character displayed incorrectly
  2272  8.2.0452  channel_parse_messages() fails when called recursively
  3245  8.2.0453  trailing space in job_start() command causes empty argument
  6485  8.2.0454  some tests fail when the system is slow
 19952  8.2.0455  cannot set the highlight group for a specific terminal
  2705  8.2.0456  Test_confirm_cmd is flaky
  2425  8.2.0457  Test_quotestar() often fails when run under valgrind
  1622  8.2.0458  missing feature check in test function
 47687  8.2.0459  cannot check if a function name is correct
  2644  8.2.0460  build failure because of wrong feature name
  1571  8.2.0461  confirm test fails on amd64 system
  3344  8.2.0462  previewwindow test fails on some systems
  2512  8.2.0463  build error without float and channel feature
  5648  8.2.0464  typos and other small problems
  5874  8.2.0465  Vim9: dead code and wrong return type
  4471  8.2.0466  not parsing messages recursively breaks the govim plugin
  8203  8.2.0467  Vim9: some errors are not tested
  7139  8.2.0468  GUI: pixel dust with some fonts and characters
  4360  8.2.0469  Vim9: no error for missing ] after list
  1964  8.2.0470  Test_confirm_cmd_cancel() can fail on a slow system
  1742  8.2.0471  missing change to compile_list()
  1387  8.2.0472  terminal highlight name is set twice, leaking memory
  3546  8.2.0473  variables declared in an outer scope
  3388  8.2.0474  cannot use :write when using a plugin with BufWriteCmd
  2200  8.2.0475  channel out_cb test still fails sometimes on Mac
  2355  8.2.0476  terminal nasty callback test fails sometimes
  3314  8.2.0477  Vim9: error messages not tested
  4593  8.2.0478  new buffers are not added to the Buffers menu
  4619  8.2.0479  unloading shared libraries on exit has no purpose
  3494  8.2.0480  Vim9: some code is not tested
  7070  8.2.0481  Travis is still using trusty
 31807  8.2.0482  channel and sandbox code not sufficiently tested
  2688  8.2.0483  Vim9: "let x = x + 1" does not give an error
  2872  8.2.0484  Vim9: some error messages not tested
  2494  8.2.0485  Vim9 script test fails
  7966  8.2.0486  Vim9: some code and error messages not tested
  9517  8.2.0487  Vim9: compiling not sufficiently tested
  5274  8.2.0488  Vim9: compiling can break when using a lambda inside :def
  6260  8.2.0489  Vim9: memory leaks
  1753  8.2.0490  Win32: VTP doesn't respect 'restorescreen'
  4764  8.2.0491  cannot recognize a <script> mapping using maparg()
  8956  8.2.0492  Vim9: some error messages not tested
 10688  8.2.0493  Vim9: some error messages not tested
  1658  8.2.0494  Vim9: asan error
  4771  8.2.0495  Vim9: some code not tested
  3400  8.2.0496  Vim9: disassemble test fails
  2604  8.2.0497  too verbose output from the asan build in Travis
  1734  8.2.0498  Coverity complains about uninitialized field
  9226  8.2.0499  calling a lambda is slower than evaluating a string
 66291  8.2.0500  using the same loop in many places
  1898  8.2.0501  Vim9: script test fails when channel feature is missing
 19346  8.2.0502  Vim9: some code is not tested
  7976  8.2.0503  Vim9: some code is not tested
  2309  8.2.0504  Vim9: leaking scope memory when compilation fails
  3719  8.2.0505  term_getty() not sufficiently tested
  1633  8.2.0506  Coverity complains about ignoring return value
  2762  8.2.0507  getbufvar() may get the wrong dictionary
 30864  8.2.0508  Vim9: func and partial types not done yet
 24280  8.2.0509  various code is not properly tested.
  2440  8.2.0510  Coverity complains about using uninitialized variable
 16222  8.2.0511  Cscope code not fully tested
 59487  8.2.0512  Vim9: no optional arguments in func type
  2963  8.2.0513  reading past allocated memory when using varargs
  7872  8.2.0514  several global functions are used in only one file
  3269  8.2.0515  some compilers cannot add to "void *"
 62078  8.2.0516  client-server code is spread out
 20530  8.2.0517  Vim9: cannot separate "func" and "func(): void"
  2171  8.2.0518  a terminal falls back to setting $TERM to "xterm"
  3535  8.2.0519  Vim9: return type not properly checked
  1684  8.2.0520  tests are not listed in sorted order
  3372  8.2.0521  crash when reading a blob fails
 19080  8.2.0522  several errors are not tested for
 24711  8.2.0523  loops are repeated
  4202  8.2.0524  Win32: searching for file matches is slow
  2287  8.2.0525  Win32: typo in assignment and misplaced paren
  1987  8.2.0526  Gcc 9 complains about empty statement
 11280  8.2.0527  Vim9: function types insufficiently tested
  4916  8.2.0528  Vim9: function arguments insufficiently tested
  4079  8.2.0529  Vim9: function argument with default not checked
  2154  8.2.0530  test crashes on s390
 18580  8.2.0531  various errors not tested
  3815  8.2.0532  cannot use simplify() as a method
 80555  8.2.0533  tests using term_wait() can still be flaky
  1907  8.2.0534  client-server test fails under valgrind
 16365  8.2.0535  regexp patterns not fully tested
  7167  8.2.0536  Vim9: some compilation code not tested
  2870  8.2.0537  Vim9: no check for sandbox when setting v:var
  6495  8.2.0538  Vim9: VAR_PARTIAL is not used during compilation
  2704  8.2.0539  comparing two NULL list fails
 27185  8.2.0540  regexp and other code not tested
 12645  8.2.0541  Travis CI does not give compiler warnings
  2850  8.2.0542  no test for E386
 22793  8.2.0543  Vim9: function with varargs does not work properly
  1659  8.2.0544  memory leak in search test
  8952  8.2.0545  unused arguments ignored in non-standard way
  8179  8.2.0546  Vim9: varargs implementation is inefficient
  3456  8.2.0547  Win32: restoring screen not always done right
  6057  8.2.0548  Vim9: not all possible func type errors tested
  4029  8.2.0549  user systemd files not recognized
  3721  8.2.0550  some changes in the libvterm upstream code
  9085  8.2.0551  not all code for options is tested
  4613  8.2.0552  Vim9: some errors not covered by tests
  1797  8.2.0553  error for unused argument
  2903  8.2.0554  the GUI doesn't set t_Co
  7648  8.2.0555  Vim9: line continuation is not always needed
  1931  8.2.0556  Vim9: memory leak when finding common type
 57292  8.2.0557  no IPv6 support for channels
  2319  8.2.0558  Vim9: dict code not covered by tests
 79607  8.2.0559  clearing a struct is verbose
  2728  8.2.0560  compiler warning in tiny build
  7223  8.2.0561  Vim9: cannot split function call in multiple lines
 17585  8.2.0562  Vim9: cannot split an expression into multiple lines
  8350  8.2.0563  Vim9: cannot split a function line
  3563  8.2.0564  Vim9: calling a def function from non-vim9 may fail
 49216  8.2.0565  Vim9: tests contain superfluous line continuation
  2226  8.2.0566  Vim9: variable can be used uninitialized
 14904  8.2.0567  Vim9: cannot put comments halfway expressions
  4334  8.2.0568  the man filetype plugin overwrites the unnamed register
  1443  8.2.0569  build failure with tiny version
  6986  8.2.0570  Vim9: no error when omitting type from argument
  2107  8.2.0571  double free when passing invalid argument to job_start()
  1481  8.2.0572  using two lines for free and reset
  3947  8.2.0573  using :version twice leaks memory
  2479  8.2.0574  ipv6 feature not shown in :version output
  2199  8.2.0575  :digraph! not tested
  3186  8.2.0576  some errors are not covered by tests
 11063  8.2.0577  not all modifiers supported for :options
170171  8.2.0578  heredoc for interfaces does not support "trim"
  1949  8.2.0579  Coverity warns for unused value
  3352  8.2.0580  window size wrong if 'ea' is off and 'splitright' is on
  3366  8.2.0581  Win32 console: the cursor position is always top-left
  3881  8.2.0582  color ramp test does not show text colors
  5624  8.2.0583  Vim9: # comment not recognized in :def function
  1871  8.2.0584  viminfo file uses obsolete function file_readable()
  9320  8.2.0585  Vim9: # comment not recognized after :vim9script
  2928  8.2.0586  Vim9: # comment not sufficiently tested
  1514  8.2.0587  compiler warning for unused variable
  2896  8.2.0588  Putty does not use "sgr" 'ttymouse' by default
  2692  8.2.0589  .bsd file type not recognized
 10197  8.2.0590  no 'backspace' value allows ignoring the insertion point
  2078  8.2.0591  MS-Windows: should always support IPv6
  1452  8.2.0592  MS-Windows with VTP: cursor is not made invisible
  3454  8.2.0593  finding a user command is not optimal
  5569  8.2.0594  MS-Windows: cannot build with WINVER set to 0x0501
 13856  8.2.0595  Vim9: not all commands using ends_excmd() tested
  2578  8.2.0596  crash in test49
 11893  8.2.0597  test_eval is old style
  2095  8.2.0598  test_eval_stuff fails in normal terminal
 39503  8.2.0599  Netbeans interface insufficiently tested
 15104  8.2.0600  Vim9: cannot read or write w:, t: and b: variables
 18763  8.2.0601  Vim9: :unlet is not compiled
  5346  8.2.0602  :unlet $VAR does not work properly
  3436  8.2.0603  configure does not detect moonjit
  2555  8.2.0604  :startinsert in a terminal window used later
  5493  8.2.0605  Vim9: cannot unlet an environment variable
  6521  8.2.0606  several syntax HL errors not checked
  3281  8.2.0607  gcc warns for using uninitialized variable
  1825  8.2.0608  warning from clang when building message test
  2638  8.2.0609  configure does not detect moonjit correctly
 20102  8.2.0610  some tests are still old style
  4958  8.2.0611  Vim9: no check for space before #comment
 10955  8.2.0612  Vim9: no check for space before #comment
 19950  8.2.0613  Vim9: no check for space before #comment
 13804  8.2.0614  get ml_get error when deleting a line in 'completefunc'
 20671  8.2.0615  regexp benchmark stest is old style
  1630  8.2.0616  build error when disabling the diff feature
  2537  8.2.0617  new error check triggers in Swedish menu
  2449  8.2.0618  echoing a null list results in no output
 14373  8.2.0619  null dict is not handled like an empty dict
  5710  8.2.0620  error in menu translations
  2572  8.2.0621  after running tests asan files may remain
 12786  8.2.0622  Haiku: GUI does not compile
  1515  8.2.0623  typo in test comment
  8560  8.2.0624  Vim9: no check for space before #comment
  4724  8.2.0625  Vim9: confusing error when calling unknown function
 13965  8.2.0626  Vim9: wrong syntax of function in Vim9 script
  1400  8.2.0627  Vim9: error message does not work
 80527  8.2.0628  error in menu translations
  3002  8.2.0629  setting a boolean option to v:false does not work
  1243  8.2.0630  "make tags" does not cover Haiku GUI file
256246  8.2.0631  Haiku file formatted with wrong tabstop
  1446  8.2.0632  crash when using Haiku
 13635  8.2.0633  crash when using null partial in filter()
 19251  8.2.0634  crash with null partial and blob
  1648  8.2.0635  when using 256 colors DarkYellow does not show expected color
  1532  8.2.0636  :messages does not show the maintainer when $LANG is unset
  3257  8.2.0637  incsearch highlighting does not work for ":sort!"
  1522  8.2.0638  MS-Windows: messages test fails
  3529  8.2.0639  MS-Windows: messages test still fails
 42251  8.2.0640  Vim9: expanding `=expr` does not work
  5150  8.2.0641  Vim9: `=expr` not expanded in :hardcopy and syn-include
  2452  8.2.0642  Vim9: using invalid index
  2947  8.2.0643  terminal uses brown instead of dark yellow
 16983  8.2.0644  insufficient testing for invalid function arguments
  1885  8.2.0645  MS-Windows terminal: CTRL-C does not get to child job
  3028  8.2.0646  t_Co uses the value of $COLORS in the GUI
  2158  8.2.0647  MS-Windows: repeat count for events was not used
  2826  8.2.0648  semicolon search does not work in first line
  2820  8.2.0649  undo problem when an InsertLeave autocommand resets undo
 35386  8.2.0650  Vim9: script function can be deleted
  1496  8.2.0651  old style benchmark test still in list of distributed files
  2106  8.2.0652  compiler warning for char conversion
  4836  8.2.0653  using uninitialized pointer
  1488  8.2.0654  building with Python fails
 26350  8.2.0655  search code not sufficiently tested
  3410  8.2.0656  MS-Windows: redrawing right screen edge may not be needed
  6097  8.2.0657  Vim9: no check if called variable is a FuncRef
  1772  8.2.0658  HP-UX build fails when setenv() is not defined
  4013  8.2.0659  Vim9: no test for equal func type
118151  8.2.0660  the search.c file is a bit big
 24388  8.2.0661  eval test is still old style
  4767  8.2.0662  cannot use input() in a channel callback
  3841  8.2.0663  not all systemd temp files are recognized
  8718  8.2.0664  included undesired changes in Makefile
  6066  8.2.0665  wrongly assuming Python executable is called "python"
  3259  8.2.0666  Ruby test fails on MS-Windows
 26612  8.2.0667  cannot install Haiku version from source
  1562  8.2.0668  compiler warning for int/size_t usage
 16315  8.2.0669  MS-Windows: display in VTP is a bit slow
 20544  8.2.0670  cannot change window when evaluating 'completefunc'
  3380  8.2.0671  Haiku: compiler warnings
  5492  8.2.0672  heredoc in scripts does not accept lower case marker
  1726  8.2.0673  cannot build Haiku in shadow directory
 79652  8.2.0674  some source files are too big
 22831  8.2.0675  Vim9: no support for closures
  1641  8.2.0676  pattern in list of distributed files does not match
 23542  8.2.0677  Vim9: no support for closures
  1780  8.2.0678  rare crash for popup menu
 27973  8.2.0679  Vim9: incomplete support for closures
  6905  8.2.0680  PTYGROUP and PTYMODE are unused
  1493  8.2.0681  pattern for 'hlsearch' highlighting may leak
  1883  8.2.0682  Vim9: parsing function argument type can get stuck
  6353  8.2.0683  Vim9: parsing type does not always work
 12152  8.2.0684  Vim9: memory leak when using lambda
  2097  8.2.0685  Build failure
  7595  8.2.0686  formatoptions not sufficiently tested
  5248  8.2.0687  some tests do not work on FreeBSD
  2726  8.2.0688  output clobbered if setting 'verbose' to see shell commands
  2291  8.2.0689  when using getaddrinfo() the error message is unclear
  3405  8.2.0690  line number of option set by modeline is wrong
  2021  8.2.0691  startup test fails
  1997  8.2.0692  startup test fails on MS-Windows
  6133  8.2.0693  closure using argument not tested
  7899  8.2.0694  Haiku: channel and terminal do not work
 16197  8.2.0695  Vim9: cannot define a function inside a function
  5946  8.2.0696  Vim9: nested function does not work properly
  3023  8.2.0697  Vim9: memory leak when using nested function
  7906  8.2.0698  insert mode completion not fully tested
  9168  8.2.0699  Vim9: not all errors tested
  2651  8.2.0700  Vim9: converting error message to exception not tested
  2076  8.2.0701  Vim9 test fails without job feature
  1516  8.2.0702  running channel tests may leave running process behind
  9195  8.2.0703  Vim9: closure cannot store value in outer context
  2755  8.2.0704  Vim9: memory leak in disassemble test
  1829  8.2.0705  indent tests don't run on CI for FreeBSD
  3192  8.2.0706  Vim9: using assert_fails() causes function to finish
  1595  8.2.0707  Vim9 function test fails
 24586  8.2.0708  Vim9: constant expressions are not simplified
  1509  8.2.0709  MS-Windows: compiler warning for int vs size_t
  1547  8.2.0710  Netbeans test sometimes fails
  6638  8.2.0711  temp directory might be cleared
  5231  8.2.0712  various code not fully tested
  2152  8.2.0713  the pam_environment file is not recognized
 13770  8.2.0714  Vim9: handling constant expression does not scale
  1430  8.2.0715  Vim9: leaking memory
  2728  8.2.0716  Vim9: another memory leak
 20204  8.2.0717  Vim9: postponed constant expressions does not scale
  1654  8.2.0718  gcc warning for returning pointer to local variable
 45696  8.2.0719  Vim9: more expressions can be evaluated at compile time
  2159  8.2.0720  occasional exit when encountering an X error
  1746  8.2.0721  Vim9: leaking memory when skipping
 12869  8.2.0722  Vim9: not handling constant expression for elseif
  5203  8.2.0723  Vim9: nested constant expression not evaluated compile time
  1984  8.2.0724  Vim9: appending to buffer/window/tab variable not tested
 19244  8.2.0725  Vim9: cannot call a function declared later in Vim9 script
  2374  8.2.0726  Vim9: leaking memory when calling not compiled :def function
  1969  8.2.0727  MS-Windows: new gcc compiler does not support scanf format
  2972  8.2.0728  messages about a deadly signal are not left aligned
  6005  8.2.0729  Vim9: When reloading a script variables are not cleared
 32353  8.2.0730  Vim9: Assignment to dict member does not work
  2208  8.2.0731  Vim9: parsing declarations continues after :finish
  2247  8.2.0732  Vim9: storing value in dict messes up stack
  5593  8.2.0733  Vim9: assigning to dict or list argument does not work
  1751  8.2.0734  Vim9: leaking memory when using :finish
  1997  8.2.0735  Vim9: using unitialized memory
  2755  8.2.0736  some files not recognized as pamenv
  3643  8.2.0737  when shell doesn't support CTRL-Z Vim still handles it
 22852  8.2.0738  mouse handling in a terminal window not well tested
  4785  8.2.0739  incomplete profiling when exiting because of a deadly signal
 11953  8.2.0740  minor message mistakes
 51488  8.2.0741  Python tests fail because of changed message
  2914  8.2.0742  handling of a TERM signal not tested
  2639  8.2.0743  can move to another buffer from a terminal in popup window
  1921  8.2.0744  the name vim is not capitalized in a message
  2463  8.2.0745  crash on exit when not all popups are closed
  4684  8.2.0746  popup_clear() hangs when a popup can't be closed
 14071  8.2.0747  cannot forcefully close all popups
  7749  8.2.0748  cannot get a list of all popups
  1733  8.2.0749  TERM signal test fails on FreeBSD
  2593  8.2.0750  netbeans test is a bit flaky
 26178  8.2.0751  Vim9: performance can be improved
  2170  8.2.0752  terminal in popup window test is a bit flaky
 45540  8.2.0753  Vim9: expressions are evaluated in the discovery phase
  1981  8.2.0754  Vim9: No test for forward declaration
  5297  8.2.0755  Vim9: No error when variable initializer is not a constant
  1878  8.2.0756  MS-Windows: still a compiler warning
 11771  8.2.0757  Vim9: no test for MEMBER instruction
 22918  8.2.0758  Vim9: no test for STORELIST and STOREDICT
 10549  8.2.0759  Vim9: missing changes for performance improvements
  2814  8.2.0760  Vim9: dict member errors not tested
  5874  8.2.0761  Vim9: instructions not tested
  2383  8.2.0762  buffer is not considered modified after setting crypt key
  1560  8.2.0763  GUI test fails without the terminal feature
  4025  8.2.0764  Vim9: assigning to option not fully tested
 12233  8.2.0765  In the GUI can't use all the modifiers.
  3288  8.2.0766  display error when using 'number' and 'breakindent'
  1703  8.2.0767  modifyOtherKeys active when using a shell command in autocmd
  1807  8.2.0768  Vim9: memory leak in script test
  3319  8.2.0769  VimLeavePre not triggered when Vim is terminated
  3111  8.2.0770  cannot map CTRL-B when using the GUI
  8140  8.2.0771  Vim9: cannot call a compiled closure from not compiled code
  2557  8.2.0772  Vim9: some variable initializations not tested
  5532  8.2.0773  switching to raw mode every time ":" is used
 12623  8.2.0774  t_TI and t_TE are output when using 'visualbell'
 12686  8.2.0775  not easy to call a Vim function from Lua
  6976  8.2.0776  libvterm code lags behind the upstream version
  2194  8.2.0777  terminal test fails
  8259  8.2.0778  libvterm code lags behind the upstream version
  2165  8.2.0779  tmode_T not used everywhere
 45046  8.2.0780  libvterm code lags behind the upstream version
  1521  8.2.0781  compiler warning for not using value in Lua
  2280  8.2.0782  cannot build with Lua on MS-Windows
 11605  8.2.0783  libvterm code lags behind the upstream version
 10344  8.2.0784  libvterm code lags behind the upstream version
  9349  8.2.0785  libvterm code lags behind the upstream version
  2347  8.2.0786  channel test is flaky on FreeBSD
 17610  8.2.0787  libvterm code lags behind the upstream version
  1783  8.2.0788  memory leak in libvterm
  3855  8.2.0789  Vim9: expression testing lost coverage using constants
  3754  8.2.0790  Vim9: list index not well tested
 10932  8.2.0791  a second popup window with terminal causes trouble
  1372  8.2.0792  build failure with small features
  2126  8.2.0793  MS-Windows: cannot build GUI with small features
 15805  8.2.0794  libvterm code lags behind the upstream version
 24008  8.2.0795  libvterm code lags behind the upstream version
  1666  8.2.0796  MS-Windows: compiler can't handle C99 construct in libvterm
  1528  8.2.0797  MS-Windows: compiler still can't handle C99 construct
 49936  8.2.0798  libvterm code lags behind the upstream version
  2786  8.2.0799  build fails if snprintf is not available
  8176  8.2.0800  errors from failing test are unclear
  3436  8.2.0801  terminal test fails on Mac
 17507  8.2.0802  libvterm code lags behind the upstream version
 11236  8.2.0803  libvterm code lags behind the upstream version
 45937  8.2.0804  libvterm code lags behind the upstream version
  4075  8.2.0805  terminal key codes test fails on some systems
  2606  8.2.0806  using "func!" after vim9script gives confusing error
 17954  8.2.0807  cannot easily restore a mapping
 10568  8.2.0808  not enough testing for the terminal window
  3157  8.2.0809  build failure with small features
  2405  8.2.0810  error when appending "tagfile" to 'wildoptions'
  3307  8.2.0811  terminal keycode test is flaky
  4832  8.2.0812  mapset() does not properly handle <> notation
 53461  8.2.0813  libvterm code is slightly different from upstream
  1720  8.2.0814  clang warning for implicit conversion
 14439  8.2.0815  maparg() does not provide enough information for mapset()
  7064  8.2.0816  terminal test fails when compiled with Athena
  3249  8.2.0817  not enough memory allocated when converting string
 59063  8.2.0818  Vim9: using a discovery phase doesn't work well
  1370  8.2.0819  compiler warning for unused variable
  9497  8.2.0820  Vim9: function type isn't set until compiled
  2338  8.2.0821  Vim9: memory leak in expr test
  8319  8.2.0822  Vim9: code left over from discovery phase
 18661  8.2.0823  Vim9: script reload test is disabled
  2473  8.2.0824  still not enough memory allocated when converting string
  1699  8.2.0825  def_function() may return pointer that was freed
  2120  8.2.0826  Vim9: crash in :defcompile
  1312  8.2.0827  Vim9: crash in :defcompile
  5047  8.2.0828  Travis: regexp patttern doesn't work everywhere
  2599  8.2.0829  filter() may give misleading error message
  1534  8.2.0830  Motif: can't map "!"
  2580  8.2.0831  compiler warnings for integer sizes
  1655  8.2.0832  compiler warning for uninitialized variable
  1445  8.2.0833  mapping <C-bslash> doesn't work in the GUI
  2125  8.2.0834  :drop command in terminal popup causes problems
  2640  8.2.0835  Motif: mapping <C-bslash> still doesn't work
  4806  8.2.0836  not all :cdo output is visible
  1895  8.2.0837  compiler warning for value set but not used
  1606  8.2.0838  MS-Windows: compiler warning for uninitialized variables
  8408  8.2.0839  dropping modifier when putting a character back in typeahead
  3566  8.2.0840  search match count wrong when only match is in fold
  2831  8.2.0841  'verbose' value 16 causes duplicate output
  1934  8.2.0842  MS-Windows: channel tests fail
  2014  8.2.0843  filetype elm not detected
 18669  8.2.0844  text properties crossing lines not handled correctly
 28991  8.2.0845  text properties crossing lines not handled correctly
  1465  8.2.0846  build failure with small features
 91017  8.2.0847  typval related code is spread out
  8172  8.2.0848  MS-Windows: the Windows terminal code has some flaws
 34051  8.2.0849  BeOS code is not maintained and probably unused
 13165  8.2.0850  MS-Windows: exepath() works different from cmd.exe
  6500  8.2.0851  can't distinguish <M-a> from accented "a" in the GUI
  1612  8.2.0852  cannot map CTRL-S on some systems
 24753  8.2.0853  ml_delete() often called with FALSE argument
  6194  8.2.0854  xxd cannot show offset as a decimal number
 16418  8.2.0855  GUI tests fail because the test doesn't use a modifier
  1961  8.2.0856  CTRL-S stops output
  1936  8.2.0857  GTK cell height can be a pixel too much
  8358  8.2.0858  not easy to require Lua modules
 56215  8.2.0859  no Turkish translation of the manual
 12163  8.2.0860  cannot use CTRL-A and CTRL-X on unsigned numbers
  8533  8.2.0861  cannot easily get all the current marks
  3882  8.2.0862  ":term ++curwin" makes the current buffer hidden
 23695  8.2.0863  cannot set a separate color for underline/undercurl
  5138  8.2.0864  pragmas are indented all the way to the left
 12288  8.2.0865  syntax foldlevel is taken from the start of the line
 20512  8.2.0866  not enough tests for buffer writing
  9504  8.2.0867  using \{xxx} for encoding a modifier is not nice
  8505  8.2.0868  trim() always trims both ends
 28185  8.2.0869  it is not possible to customize the quickfix window contents
  1618  8.2.0870  MS-Windows: Control keys don't work in the GUI
  4817  8.2.0871  cannot use getmarklist() as a method
107599  8.2.0872  XIM code is mixed with multi-byte code
  3006  8.2.0873  a .jl file can be sawfish (lisp) or Julia
  2245  8.2.0874  signals test is a bit flaky
 30776  8.2.0875  getting attributes for directory entries is slow
  4533  8.2.0876  :pwd does not give a hint about the scope of the directory
 28460  8.2.0877  cannot get the search statistics
  9371  8.2.0878  no reduce() function
  1494  8.2.0879  compiler warning for unused function argument
  1490  8.2.0880  leaking memory when using searchcount()
  1519  8.2.0881  compiler warning for argument type
  4060  8.2.0882  leaking memory when using reduce()
  1368  8.2.0883  memory leak in test 49
  4146  8.2.0884  searchcount() test fails on slower systems
  1858  8.2.0885  "make shadow" does not link new lua test dir
 10544  8.2.0886  cannot use octal numbers in scriptversion 4
  2538  8.2.0887  searchcount().exact_match is 1 right after a match
  2852  8.2.0888  readdirex() returns size -2 for a directory
  6358  8.2.0889  using old style comments
  1875  8.2.0890  no color in terminal window when 'termguicolor' is set
  1622  8.2.0891  clang warns for invalid conversion
  2844  8.2.0892  ubsan warns for undefined behavior
  6245  8.2.0893  assert_equalfile() does not take a third argument
  8979  8.2.0894  :mkspell can take very long if the word count is high
 10810  8.2.0895  :mkspell output does not mention the tree type
  2969  8.2.0896  crash when calling searchcount() with a string
 24142  8.2.0897  list of functions in patched version is outdated
  5020  8.2.0898  missing help for a function goes unnoticed
  4693  8.2.0899  assert_equalfile() does not give a hint about the difference
  2332  8.2.0900  function list test fails on MS-Windows
 17280  8.2.0901  formatting CJK text isn't optimal
  4270  8.2.0902  using searchcount() in 'statusline' causes an error
  1723  8.2.0903  comparing WINVER does not work correctly
  2538  8.2.0904  assuming modifyOtherKeys for rhs of mapping
  2693  8.2.0905  test coverage could be better
  2776  8.2.0906  when setting 'termguicolors' SpellBad is no longer red
  2499  8.2.0907  when using :global clipboard isn't set correctly
  5365  8.2.0908  crash when changing the function table while listing it
  9916  8.2.0909  cannot go back to the previous local directory
  5851  8.2.0910  Vim is not reproducibly buildable
  4609  8.2.0911  crash when opening a buffer for the cmdline window fails
  6066  8.2.0912  a few test cases for CJK formatting are disabled
  3930  8.2.0913  code for resetting v:register is duplicated
  3014  8.2.0914  MS-Windows: cannot specify a "modified by" text
 15395  8.2.0915  search() cannot skip over matches like searchpair() can
  8585  8.2.0916  mapping with partly modifyOtherKeys code does not work
  6548  8.2.0917  quickfix entries do not suport a "note" type
 12276  8.2.0918  duplicate code for evaluating expression argument
  4792  8.2.0919  merging modifier for modifyOtherKeys is done twice
  3619  8.2.0920  writing viminfo fails with a circular reference
  3236  8.2.0921  CTRL-W T in cmdline window causes trouble
  2948  8.2.0922  search test fails
  2397  8.2.0923  cmdline test is slow
 15421  8.2.0924  cannot save and restore a register properly
  7806  8.2.0925  getcompletion() does not return command line arguments
  4669  8.2.0926  cmdline test fails on Appveyor
  3048  8.2.0927  some sshconfig and ssdhconfig files are not recognized
 11902  8.2.0928  many type casts are used for vim_strnsave()
  4019  8.2.0929  v:register is not cleared after an operator was executed
  4286  8.2.0930  script filetype detection trips over env -S argument
 20145  8.2.0931  some remarks about BeOS remain
  3293  8.2.0932  missspelling spelllang
  7490  8.2.0933  'quickfixtextfunc' does not get window ID of location list
  2862  8.2.0934  lhelpgrep twice in help window doesn't jump to the help topic 
 11514  8.2.0935  flattening a list with existing code is slow
 17977  8.2.0936  some terminals misinterpret the code for getting cursor style
  1756  8.2.0937  asan failure in the flatten() test
  6310  8.2.0938  NFA regexp uses tolower ()to compare ignore-case
 38367  8.2.0939  checking for term escape sequences is long and confusing
  2307  8.2.0940  build failure with tiny features
 17772  8.2.0941  detecting terminal properties is unstructured
  2971  8.2.0942  expanding to local dir after homedir keeps "~/"
 12489  8.2.0943  displaying ^M or ^J depends on current buffer
  1452  8.2.0944  xxd test leaves file behind
 10205  8.2.0945  cannot use "z=" when 'spell' is off
  3433  8.2.0946  cannot use "q" to cancel a number prompt
  3712  8.2.0947  readdirex() doesn't handle broken link properly
  3193  8.2.0948  spell test fails
  1974  8.2.0949  strptime() does not use DST
  1569  8.2.0950  tagjump test fails
  1536  8.2.0951  search stat test has leftover from debugging
  8396  8.2.0952  no simple way to interrupt Vim
  7919  8.2.0953  spell checking doesn't work for CamelCased words
  2708  8.2.0954  not all desktop files are recognized
  1487  8.2.0955  build fails
  2756  8.2.0956  spell test fails
  1565  8.2.0957  compiler warning for uninitialized variable
  3956  8.2.0958  not sufficient testing for buffer writing
 12626  8.2.0959  using 'quickfixtextfunc' is a bit slow
  7325  8.2.0960  cannot use :import in legacy Vim script
 11668  8.2.0961  MS-Windows: no completion for locales
  1867  8.2.0962  terminal test sometimes hangs on Travis
  5286  8.2.0963  number increment/decrement does not work with 'virtualedit'
  4065  8.2.0964  TextYankPost does not provide info about Visual selection
  2009  8.2.0965  has_funcundefined() is not used
  5065  8.2.0966  'shortmess' flag "n" not used in two places
 31028  8.2.0967  unnecessary type casts for vim_strnsave()
 21225  8.2.0968  no proper testing of the 'cpoptions' flags
  5788  8.2.0969  assert_equal() output for dicts is hard to figure out
 16829  8.2.0970  terminal properties are not available in Vim script
  1982  8.2.0971  build with tiny features fails
  6550  8.2.0972  Vim9 script variable declarations need a type
  6075  8.2.0973  Vim9: type is not checked when assigning to a script variable
  1410  8.2.0974  Vim9: memory leak when script var has wrong type
  3185  8.2.0975  Vim9: script variable does not accept optional s: prefix
 15334  8.2.0976  some 'cpoptions' not tested
  4167  8.2.0977  t_8u is made empty for the wrong terminals
  1815  8.2.0978  leaking memory in termcodes test
  2136  8.2.0979  a couple of screendump tests fail
  2410  8.2.0980  raku file extension not recognized
 47932  8.2.0981  Vim9: cannot compile "[var, var] = list"
 10734  8.2.0982  insufficient testing for reading/writing files
  2723  8.2.0983  SConstruct file type not recognized
  3515  8.2.0984  not using previous window when closing a shell popup window
  3603  8.2.0985  simplify() does not remove slashes from "///path"
  2080  8.2.0986  MS-Windows: functions test fails
 11962  8.2.0987  Vim9: cannot assign to [var; var]
 32430  8.2.0988  getting directory contents is always case sorted
  2771  8.2.0989  crash after resizing a terminal window
  2806  8.2.0990  Using duplicate error number
  3947  8.2.0991  cannot get window type for autocmd and preview window
  5662  8.2.0992  Vim9: crash when using :import in the Vim command
  2373  8.2.0993  Vim9 script test fails with normal features
  2491  8.2.0994  Vim9: missing function causes compilation error
  2023  8.2.0995  insufficient testing for the readdir() sort option
  3015  8.2.0996  using "aucmdwin" in win_gettype() is not ideal
  7462  8.2.0997  cannot execute a register containing line continuation
  3483  8.2.0998  not all tag code is tested
  2854  8.2.0999  moving to next sentence gets stuck on quote
  2829  8.2.1000  get error when leaving Ex mode with :visual
  5742  8.2.1001  Vim9: crash with nested "if" and assignment
  1962  8.2.1002  test may fail when run directly
  2911  8.2.1003  Vim9: return type of sort() is too generic
  8721  8.2.1004  line numbers below filler lines not always updated
 12329  8.2.1005  Vim9: using TRUE/FALSE/MAYBE for ctx_skip is confusing
 13113  8.2.1006  Vim9: require unnecessary return statement
  2375  8.2.1007  completion doesn't work after ":r ++arg !"
  2500  8.2.1008  Vim9: no test for disassambling newly added instructions
  2962  8.2.1009  Vim9: some failures not checked for
  1797  8.2.1010  build failure in libvterm with debug enabled
  6981  8.2.1011  Vim9: some code not tested
  3799  8.2.1012  Vim9: cannot declare single character script variables
  4206  8.2.1013  channel tests can be a bit flaky
  5436  8.2.1014  using "name" for a string result is confusing
  4692  8.2.1015  popup filter gets key with modifier prepended
  1580  8.2.1016  Vim9: test fails when channel feature is missing
  2995  8.2.1017  Appveyor output doesn't show MinGW console features
  4809  8.2.1018  typo in enum value
  5291  8.2.1019  mapping <M-S-a> does not work in the GUI
  1677  8.2.1020  popupwin test fails in the GUI
  2351  8.2.1021  Ruby interface not tested enough
 20586  8.2.1022  various parts of code not covered by tests
 18651  8.2.1023  Vim9: redefining a function uses a new index every time
  7542  8.2.1024  Vim9: no error for using "let g:var = val"
  4908  8.2.1025  tabpage menu and tabline not sufficiently tested
  4588  8.2.1026  Vim9: cannot break the line after "->"
  2987  8.2.1027  GUI: multi-byte characters do not work in a terminal
 10721  8.2.1028  Vim9: no error for declaring buffer, window, etc. variable
  9641  8.2.1029  Vim9: cannot chain function calls with -> at line start
  3465  8.2.1030  reducing size of a terminal window may cause a crash
  2247  8.2.1031  build failure with Perl5.32
  3173  8.2.1032  error message for declaring a variable cannot be translated
  2292  8.2.1033  not easy to read the test time in the test output
  1794  8.2.1034  compiler warning for uninitialized variables
  6278  8.2.1035  setreg() does not always clear the register
  1812  8.2.1036  popupwin test fails sometimes
  2450  8.2.1037  Vim9: crash when using line continuation inside :def
  1836  8.2.1038  popupwin test fails
  2533  8.2.1039  cannot put NUL byte on clipboard
 24906  8.2.1040  not enough testing for movement commands
  2183  8.2.1041  test summary is missing executed count
  9901  8.2.1042  Vim9: cannot put an operator on the next line
  1869  8.2.1043  %a item in 'statusline' not tested
  4508  8.2.1044  not all systemd file types are recognized
 16409  8.2.1045  Vim9: line break before operator does not work
 22866  8.2.1046  insufficient tests for src/buffer.c
 40535  8.2.1047  Vim9: script cannot use line continuation like :def function
  1335  8.2.1048  build failure without the eval feature
 27759  8.2.1049  Vim9: leaking memory when using continuation line
  1813  8.2.1050  missing change in struct
  3030  8.2.1051  crash when changing a list while using reduce() on it
  1599  8.2.1052  build failure with older compilers
  5227  8.2.1053  insufficient testing for 'statusline' and 'tabline'
 12476  8.2.1054  not so easy to pass a lua function to Vim
  3424  8.2.1055  no filetype set for pacman config files
 11397  8.2.1056  wrong display when mixing match conceal and syntax conceal
  2474  8.2.1057  cannot build with dynamic Lua
  3180  8.2.1058  multiline conceal causes display errors
  3814  8.2.1059  crash when using :tabonly in an autocommand
  2596  8.2.1060  not all elinks files are recognized
 13616  8.2.1061  insufficient testing for src/window.c
  3547  8.2.1062  Vim9: no line break allowed inside "cond ? val1 : val2"
  4866  8.2.1063  Vim9: no line break allowed before || or &&
  3141  8.2.1064  Vim9: no line break allowed before comperators
 10632  8.2.1065  Vim9: no line break allowed inside a list
  6312  8.2.1066  Lua arrays are zero based
  9416  8.2.1067  expression "!expr->func()" does not work
  8876  8.2.1068  Vim9: no line break allowed inside a dict
  2091  8.2.1069  Vim9: fail to check for white space in list
  1300  8.2.1070  Vim9: leaking memory when lacking white space in dict
 23612  8.2.1071  Vim9: no line break allowed inside a lambda
  2699  8.2.1072  missing libvterm test
  3000  8.2.1073  Vim9: no line break allowed in () expression
 13479  8.2.1074  Vim9: no line break allowed after some operators
  2114  8.2.1075  Vim9: no line break allowed in :echo expression
  6343  8.2.1076  Vim9: no line break allowed in :if expression
  8949  8.2.1077  not enough test coverage for highlighting
 78177  8.2.1078  highlight and match functionality together in one file
 14404  8.2.1079  Vim9: no line break allowed in a while loop
 12853  8.2.1080  Vim9: no line break allowed in a for loop
  5407  8.2.1081  Lua: cannot use table.insert() and table.remove()
  2671  8.2.1082  Coverity complains about ignoring dict_add() return value
  3443  8.2.1083  crash when using reduce() on a NULL list
  2537  8.2.1084  Lua: registering function has useless code
  2681  8.2.1085  Coverity complains about ignoring dict_add() return value
  3544  8.2.1086  possibly using freed memory when text properties used
  1706  8.2.1087  possible memory leak when file expansion fails
  2399  8.2.1088  a very long translation might cause a buffer overflow
  2258  8.2.1089  Coverity warns for pointer computation
  1638  8.2.1090  may use NULL pointer when skipping over name
  1644  8.2.1091  no check if opening a pty works
  1579  8.2.1092  not checking if saving for undo succeeds
  1357  8.2.1093  Python: double free when adding item to dict fails
  1532  8.2.1094  dead code in libvterm
  2213  8.2.1095  may use pointer after freeing it
  4325  8.2.1096  Vim9: return type of getqflist() is wrong
  3600  8.2.1097  highlight code not sufficiently tested
  2715  8.2.1098  Vim9: cannot use line break in :throw argument
  4746  8.2.1099  Vim9: cannot use line break in :cexpr argument
  4995  8.2.1100  Vim9: cannot use line break in :execute argument
  2233  8.2.1101  no error when using wrong arguments for setqflist()
  3604  8.2.1102  Coverity gets confused by an unnecessary NULL check
  1580  8.2.1103  Coverity reports an unnecessary NULL check
  1870  8.2.1104  Coverity warns for possible NULL pointer use
 14908  8.2.1105  insufficient test coverage for Lua
  2975  8.2.1106  crash when trying to use s: variable in typed command
  4059  8.2.1107  'imactivatefunc' and 'imstatusfunc' are not used in the GUI
 12157  8.2.1108  mouse left-right scroll is not supported in terminal window
  1841  8.2.1109  still crashing when using s:variable
 17701  8.2.1110  Vim9: line continuation does not work in function arguments
 23963  8.2.1111  inconsistent naming of get_list_tv() and eval_dict()
  6713  8.2.1112  Vim9: no line continuation allowed in method call
  1740  8.2.1113  no test for verbose output of :call
104121  8.2.1114  terminal test sometimes times out
  2040  8.2.1115  iminsert test fails when compiled with VIMDLL
  3781  8.2.1116  Vim9: parsing command checks for list twice
  1302  8.2.1117  Coverity warns for unsing unitialized field
  1414  8.2.1118  condition can never be true, dead code
  2579  8.2.1119  configure fails with Xcode 12 beta
267473  8.2.1120  Python code not tested properly
  2938  8.2.1121  command completion not working after ++arg
  5106  8.2.1122  Vim9: line continuation in dict member not recognized
305297  8.2.1123  Python 3 test is old style
 17742  8.2.1124  Vim9: no line break allowed in :import command
  7493  8.2.1125  Vim9: double quote can be a string or a comment
  1904  8.2.1126  Vim9: using :copen causes an error
  2602  8.2.1127  Vim9: getting a dict member may not work
  7767  8.2.1128  the write message mentions characters, but it's bytes
  4364  8.2.1129  Vim9: bar not recognized after not compiled command
  2137  8.2.1130  Vim9: bar not recognized after function call
  4115  8.2.1131  Vim9: error message for returning a value is not clear
  3173  8.2.1132  Vim9: return type of repeat() is not specific enough
  2509  8.2.1133  Vim9: return type of add() is not specific enough
  2531  8.2.1134  Vim9: getting a list member may not work
  2870  8.2.1135  Vim9: getting a dict member may not work
  3029  8.2.1136  Vim9: return type of argv() is always any
  6981  8.2.1137  Vim9: modifiers not cleared after compiling function
  3693  8.2.1138  Vim9: return type of copy() and deepcopy() is any
  2546  8.2.1139  Vim9: test for silent echo fails in some environments
  2564  8.2.1140  Vim9: return type of extend() is any
  2837  8.2.1141  Vim9: return type of filter() is any
  2771  8.2.1142  Vim9: return type of insert() is any
  3508  8.2.1143  Vim9: return type of remove() is any
  2523  8.2.1144  Vim9: return type of reverse() is any
  4982  8.2.1145  Vim9: "for" only accepts a list at compile time
 48005  8.2.1146  not enough testing for Python
  9434  8.2.1147  :confirm may happen in cooked mode
  3160  8.2.1148  warning for using int instead of size_t
  3396  8.2.1149  Vim9: :eval command not handled properly
  6243  8.2.1150  ml_get error when using Python
  6275  8.2.1151  insufficient test coverage for Python
  2924  8.2.1152  Vim9: function reference is missing script prefix
  1811  8.2.1153  Vim9: script test fails on some systems
  9394  8.2.1154  Vim9: crash when using imported function
 17167  8.2.1155  Vim9: cannot handle line break inside lambda
  2305  8.2.1156  Vim9: No error for invalid command in compiled function
  2883  8.2.1157  Vim9: dict.name is not recognized as an expression
  1525  8.2.1158  build error
  3080  8.2.1159  Vim9: no error for missing space after a comma
  3173  8.2.1160  Vim9: memory leak in allocated types
 12231  8.2.1161  Vim9: using freed memory
  1915  8.2.1162  crash when using a lambda
  1531  8.2.1163  build error
  2644  8.2.1164  text cleared by checking terminal properties not redrawn
  6407  8.2.1165  insufficient testing for the Tcl interface
  3171  8.2.1166  once mouse move events are enabled getchar() returns them
 10210  8.2.1167  Vim9: builtin function method call only supports first arg
  2051  8.2.1168  wrong method argument for appendbufline()
  1762  8.2.1169  write NUL past allocated space using corrupted spell file
  2341  8.2.1170  cursor off by one with block paste while 'virtualedit' "all"
  1535  8.2.1171  possible crash when out of memory
  1977  8.2.1172  error messages when doing "make clean" in doc or tee
  1773  8.2.1173  tee doesn't build on some systems
  1885  8.2.1174  no test for the "recording @x" message
  4469  8.2.1175  Vim9: cannot split a line before ".member"
  4457  8.2.1176  Vim9: not enough type checking in Vim9 script
 67157  8.2.1177  terminal2 test sometimes hangs in the GUI
  2838  8.2.1178  Vim9: filter function recognized as command modifier
  1459  8.2.1179  Test_termwinscroll() sometimes hangs in the GUI
  1739  8.2.1180  build failure in small version
  3206  8.2.1181  json code not fully tested
  3227  8.2.1182  Vim9: no check for whitespace after comma in lambda
 70649  8.2.1183  assert_fails() checks the last error message
  3491  8.2.1184  some tests fail
  5058  8.2.1185  some other tests fail
 12119  8.2.1186  with SGR mouse codes balloon doesn't show up after click
  3691  8.2.1187  terminal2 test sometimes hangs in the GUI on Travis
  2925  8.2.1188  memory leak with invalid json input
 12084  8.2.1189  Vim9: line continuation in lambda doesn't always work
 12097  8.2.1190  Vim9: checking for Vim9 syntax is spread out
  2312  8.2.1191  Vim9: crash when function calls itself
  3456  8.2.1192  Lua test fails with older Lua version
  5517  8.2.1193  terminal window not redrawn when dragging a popup window
  2675  8.2.1194  test failure because shell prompt differs
  2035  8.2.1195  clientserver test fails on MS-Windows
  1485  8.2.1196  build failure with normal features
  2032  8.2.1197  clientserver test still fails on MS-Windows
  4758  8.2.1198  terminal2 test sometimes hangs in the GUI on Travis
  6270  8.2.1199  not all assert functions are fully tested
  2691  8.2.1200  Vim9: cannot disassemble a lambda function
  3101  8.2.1201  Vim9: crash when passing number as dict key
  4035  8.2.1202  Vim9: crash when calling a closure from a builtin function
  4395  8.2.1203  unused assignments in expression evaluation
  2740  8.2.1204  Vim9: true and false not recognized in Vim9 script
  8624  8.2.1205  Vim9: && and || work different when not compiled
  1795  8.2.1206  Vim9: crash in expr test when run in the GUI
  3471  8.2.1207  Vim9: crash in expr test when run in the GUI
  1552  8.2.1208  build failure
  1855  8.2.1209  Vim9: test failure
  6029  8.2.1210  using ht_used when looping through a hashtab is less reliable
  2098  8.2.1211  removed more than dead code
  2861  8.2.1212  cannot build with Lua 5.4
 19382  8.2.1213  mouse codes not tested sufficiently
  5157  8.2.1214  MS-Windows: default _vimrc not correct in silent install mode
 34354  8.2.1215  Atari MiNT support is outdated
  2922  8.2.1216  startup test fails
  4612  8.2.1217  startup test depends on random source file
  6366  8.2.1218  Vim9: cannot use 'text'->func()
  5238  8.2.1219  symlink not followed if dirname ends in //
 11595  8.2.1220  memory access error when dragging a popup window
  1443  8.2.1221  memory leak when updating popup window
  1777  8.2.1222  using valgrind in Vim command started by test doesn't work
  3002  8.2.1223  Vim9: invalid type error for function default value
  3709  8.2.1224  Vim9: arguments from partial are not used
  6554  8.2.1225  linker errors when building with dynamic Python 3.9
  6188  8.2.1226  MS-Windows: windows positioning wrong depending on taskbar
 60924  8.2.1227  Vim9: allowing both quoted and # comments is confusing
 11741  8.2.1228  scrollbars not flush against the window edges when maximised
  2819  8.2.1229  build error without the eval feature
  4592  8.2.1230  Vim9: list index error not caught by try/catch
  3535  8.2.1231  MS-Windows: GUI code can be cleaned up
  2486  8.2.1232  MS-Windows GUI: Snap cancelled by split command
  7250  8.2.1233  Vim9: various errors not caught by try/catch
  3080  8.2.1234  Lua build problem with old compiler
 20949  8.2.1235  Not all mouse codes covered by tests
  9642  8.2.1236  Vim9: a few errors not caught by try/catch
  5167  8.2.1237  changing 'completepopup' after opening popup has no effect
  7786  8.2.1238  Vim9: a few remaining errors not caught by try/catch
  4440  8.2.1239  "maxwidth" in 'completepopup' not obeyed
  1511  8.2.1240  GUI tests sometimes fail because of translations
  3408  8.2.1241  cannot use getbufinfo() as a method
  4402  8.2.1242  Vim9: no error if calling a function with wrong type
  4357  8.2.1243  Vim9: cannot have a comment line halfway a list
  5185  8.2.1244  Vim9: in lambda index assumes a list
  2271  8.2.1245  build failure in tiny version
  2921  8.2.1246  Vim9: comment after assignment doesn't work
  6057  8.2.1247  Vim9: cannot index a character in a string
 44685  8.2.1248  Netbeans test is flaky in the GUI
  2412  8.2.1249  Vim9: disassemble test fails
 12197  8.2.1250  Vim9: cannot use the g:, b:, t: and w: namespaces
  3935  8.2.1251  Vim9: warning for pointer usage, test failure undetected
  5052  8.2.1252  ":marks" may show '< and '> mixed up
  1814  8.2.1253  CTRL-K in Insert mode gets <CursorHold> inserted
  1520  8.2.1254  MS-Windows: regexp test may fail if 'iskeyword' set wrongly
 27433  8.2.1255  cannot use a lambda with quickfix functions
  2530  8.2.1256  Vim9: type wrong after getting dict item in lambda
  2909  8.2.1257  Vim9: list unpack doesn't work at the script level
  1642  8.2.1258  CursorHold does not work well
  2945  8.2.1259  empty group in 'tabline' may cause using an invalid pointer
  3610  8.2.1260  there is no good test for CursorHold
  3820  8.2.1261  Vim9: common type of function not tested
 85807  8.2.1262  src/ex_cmds.c file is too big
  6067  8.2.1263  Vim9: comperators use 'ignorecase' in Vim9 script
  2037  8.2.1264  terminal getwinpos() test is a bit flaky
  1825  8.2.1265  crash with EXITFREE when split() fails
  6338  8.2.1266  Makefile preference were accidentally included
  1440  8.2.1267  MS-Windows: tests may fail due to $PROMPT value
  4014  8.2.1268  Vim9: no error for using double quote comment
 36708  8.2.1269  language and locale code spread out
  3055  8.2.1270  Vim9: not skipping over function type declaration
  2707  8.2.1271  Vim9: Error for Funcref function argument type
 11212  8.2.1272  Vim9: type not checked if declaration also assigns value
  1637  8.2.1273  MS-Windows: terminal test may leave file behind
  7098  8.2.1274  Vim9: no error for missing white space at script level
  1820  8.2.1275  Vim9: compiler warning for buffer size
  2710  8.2.1276  MS-Windows: system test may fail if more.exe is installed
  4568  8.2.1277  tests on Travis do not run with EXITFREE
  4354  8.2.1278  Vim9: line break after "->" only allowed in :def function
  2546  8.2.1279  some tests on Travis have EXITFREE duplicated
 21468  8.2.1280  Ex command error cannot contain an argument
 10731  8.2.1281  the "trailing characters" error can be hard to understand
  4059  8.2.1282  Vim9: crash when using CheckScriptFailure()
  2806  8.2.1283  Vim9: error for misplaced -> lacks argument
  2106  8.2.1284  Vim9: skipping over type includes following white space
  3758  8.2.1285  Vim9: argument types are not checked on assignment
  2375  8.2.1286  Vim9: No error when using a type on a window variable
  4510  8.2.1287  Vim9: crash when using an imported function
  2357  8.2.1288  Vim9: cannot use mark in range
  2146  8.2.1289  crash when using a custom completion function
  3769  8.2.1290  Vim9: cannot replace a global function
  4212  8.2.1291  Vim9: type of varargs items is not checked
  1879  8.2.1292  AIDL filetype not recognized
  2931  8.2.1293  Vim9: :execute mixes up () expression and function call
101699  8.2.1294  Vim9: error when using vim9script in TextYankPost
 11617  8.2.1295  tests 44 and 99 are old style
  2145  8.2.1296  some part of using 'smarcase' was not tested
 17108  8.2.1297  when a test fails it's often not easy to see where
  1424  8.2.1298  compiler warning for unused argument in small version
  2527  8.2.1299  compiler warning for using size_t for int and void pointer
  6955  8.2.1300  Vim9: optional argument type not parsed properly
  2094  8.2.1301  Vim9: varargs argument type not parsed properly
  2933  8.2.1302  Vim9: varargs arg after optional arg does not work
  2961  8.2.1303  calling popup_setoptions() resets 'signcolumn'
 17597  8.2.1304  debug backtrace isn't tested much
 20526  8.2.1305  some tests are still old style
  7487  8.2.1306  checking for first character of dict key is inconsistent
  5946  8.2.1307  popup window width does not include number of sign columns
 15751  8.2.1308  Vim9: accidentally using "x" causes Vim to exit
  2404  8.2.1309  build failure with tiny version
  2221  8.2.1310  configure with Xcode 12 fails to check for tgetent
  1728  8.2.1311  test failures with legacy Vim script
  2392  8.2.1312  MS-Windows: terminal test may fail if dir.exe exists
  9176  8.2.1313  Vim9 script: cannot assign to environment variable
  2761  8.2.1314  Vim9: rule for comment after :function is confusing
  3193  8.2.1315  MS-Windows: test log contains escape sequences
 12014  8.2.1316  test 42 is still old style
 13639  8.2.1317  MS-Windows tests on AppVeyor are slow
  1790  8.2.1318  no status badge for Github CI
  2939  8.2.1319  status badge for Github CI has wrong link
  4976  8.2.1320  Vim9: cannot declare some single letter variables
  1293  8.2.1321  GitHub CI also runs on tag push
  3535  8.2.1322  Vim9: method on double quoted string doesn't work
  5233  8.2.1323  Vim9: invalid operators only rejected in :def function
  2923  8.2.1324  Vim9: line break after "=" does not work
  3233  8.2.1325  Vim9: using Vim9 script for autaload not tested
 14661  8.2.1326  Vim9: skipping over white space after list
  5083  8.2.1327  Mac: configure can't find Tcl libraries
  3455  8.2.1328  no space allowed before comma in list
 15641  8.2.1329  Vim9: cannot define global function inside :def function
  3131  8.2.1330  Github workflow takes longer than needed
  2180  8.2.1331  Vim9: :echo with two lists doesn't work
  6913  8.2.1332  Vim9: memory leak when using nested global function
  3747  8.2.1333  Vim9: memory leak when using nested global function
  2381  8.2.1334  Github workflow timeout needs tuning
  4500  8.2.1335  CTRL-C in the GUI doesn't interrupt
  1541  8.2.1336  build failure on non-Unix systems
  2577  8.2.1337  Vim9: cannot use empty key in dict assignment
  6058  8.2.1338  Vim9: assigning to script-local variable doesn't check type
  3159  8.2.1339  Vim9: assigning to global dict variable doesn't work
 12951  8.2.1340  some tests fail on Cirrus CI and/or with FreeBSD
  1744  8.2.1341  build failures
  5805  8.2.1342  Vim9: accidentally using "t" gives a confusing error
  6044  8.2.1343  Vim9: cannot find global function when using g:
  1627  8.2.1344  Vim9: No test for trying to redefine global function
  3506  8.2.1345  Redraw error when using visual block and scroll
  1549  8.2.1346  small build fails
  5139  8.2.1347  cannot easily get the script ID
  1540  8.2.1348  build failure without the eval feature
  7626  8.2.1349  Vim9: can define a function with the name of an import
  1681  8.2.1350  Vim9: no test for error message when redefining function
  2661  8.2.1351  Vim9: no proper error if using namespace for nested function
  2830  8.2.1352  Vim9: no error for shadowing a script-local function
  2656  8.2.1353  crash when drawing double-wide character in terminal window
 51091  8.2.1354  test 59 is old style
  8352  8.2.1355  Vim9: no error using :let for options and registers
  2147  8.2.1356  Vim9: cannot get the percent register
  4573  8.2.1357  Vim9: cannot assign to / register
  2193  8.2.1358  Vim9: test fails with +dnd is not available
  3073  8.2.1359  Vim9: cannot assign to / register in Vim9 script
  2112  8.2.1360  stray error for white space after expression
  1769  8.2.1361  error for white space after expression in assignment
  2705  8.2.1362  last entry of ":set term=xxx" overwritten by error message
  1676  8.2.1363  test trying to run terminal when it is not supported
  1704  8.2.1364  invalid memory access when searching for raw string
  9672  8.2.1365  Vim9: no error for missing white space around operator
103132  8.2.1366  test 49 is old style
  5096  8.2.1367  Vim9: no error for missing white space around operator
  5283  8.2.1368  Vim9: no error for missing white space around operator
  1646  8.2.1369  MS-Windows: autocommand test sometimes fails
  1875  8.2.1370  MS-Windows: warning for using fstat() with stat_T
  3791  8.2.1371  Vim9: no error for missing white space around operator
  5317  8.2.1372  Vim9: no error for missing white space around operator
  7199  8.2.1373  Vim9: no error for assigning to non-existing script var
  3288  8.2.1374  Vim9: error for assigning empty list to script variable
  2348  8.2.1375  Vim9: method name with digit not accepted
  3520  8.2.1376  Vim9: expression mapping causes error for using :import
  1441  8.2.1377  triggering the ATTENTION prompt causes typeahead mess up
  2799  8.2.1378  cannot put space between function name and paren
  2448  8.2.1379  curly braces expression ending in " }" does not work
  3079  8.2.1380  Vim9: return type of getreg() is always a string
  4573  8.2.1381  MS-Windows: crash with Python 3.5 when stdin is redirected
  3065  8.2.1382  Vim9: using :import in filetype plugin gives an error
 62685  8.2.1383  test 49 is old style
  3836  8.2.1384  no ATTENTION prompt for :vimgrep first match file
  6704  8.2.1385  no testing on ARM
  3156  8.2.1386  backslash not removed afer space with space in 'isfname'
  2662  8.2.1387  Vim9: cannot assign to single letter variable with type
  7930  8.2.1388  Vim9: += only works for numbers
  1425  8.2.1389  file missing from the distribution
  2152  8.2.1390  Vim9: type error after storing an option value
  2028  8.2.1391  Vim9: no error for shadowing a script function
  3130  8.2.1392  Vim9: line number incorrect after skipping over comment lines
 13576  8.2.1393  insufficient testing for script debugging
  4488  8.2.1394  Vim9: compiling a function interferes with command modifiers
  7478  8.2.1395  Vim9: no error if declaring a funcref with lower case letter
  7129  8.2.1396  Vim9: no error for unexpectedly returning a value
  2962  8.2.1397  Vim9: return type of maparg() not adjusted for fourth arg
  2312  8.2.1398  autoload script sourced twice if sourced directly
  5648  8.2.1399  Vim9: may find imported item in wrong script
  3263  8.2.1400  Vim9: test does not delete written files
 13166  8.2.1401  cannot jump to the last used tabpage
  1746  8.2.1402  s390x tests always fail
  4242  8.2.1403  Vim9: Vim highlighting may fail in cmdline window
  3531  8.2.1404  Vim9: script test fails in the GUI
 53589  8.2.1405  Vim9: vim9compile.c is getting too big
  7856  8.2.1406  popupwindow lacks scrollbar if no "maxheight" is used
 15129  8.2.1407  Vim9: type of list and dict only depends on first item
  6359  8.2.1408  Vim9: type casting not supported
  7034  8.2.1409  nmpmrc and php.ini filetypes not recognized
  3321  8.2.1410  adding compiler plugin requires test change
  1978  8.2.1411  when splitting a window localdir is copied but prevdir is not
  3774  8.2.1412  Vim: not operator does not result in boolean
  5908  8.2.1413  previous tab page not usable from an Ex command
 10239  8.2.1414  popupwindow missing last couple of lines
  3315  8.2.1415  closing a popup window with CTRL-C interrupts 'statusline'
  5201  8.2.1416  Vim9: boolean evaluation does not work as intended
123226  8.2.1417  test 49 is old style
  2607  8.2.1418  Vim9: invalid error for missing white space
  7695  8.2.1419  Vim9: not operator applied too early
 82931  8.2.1420  test 49 is old style
  2025  8.2.1421  Vim9: handling "+" and "-" before number differs from script
229912  8.2.1422  the Mac GUI implementation is outdated
  2356  8.2.1423  Vim9: find global function when looking for script-local
  5305  8.2.1424  Mac build fails
  2175  8.2.1425  Vim9: cannot use call() without :call
  5821  8.2.1426  Vim9: cannot call autoload function in :def function
  3635  8.2.1427  Vim9: cannot use a range with marks in :def function
  3393  8.2.1428  Vim9: :def function does not abort on nested function error
  3113  8.2.1429  Vim9: no error for missing white after : in dict
  4383  8.2.1430  Vim9: error for missing comma instead of extra white space
  2951  8.2.1431  Vim9: no error for white space before comma in dict
152130  8.2.1432  various inconsistencies in test files
  2761  8.2.1433  Vim9: cannot mingle comments in multi-line lambda
  2408  8.2.1434  Vim9: crash when lambda uses outer function argument
 14131  8.2.1435  Vim9: always converting to string for ".." leads to mistakes
  4547  8.2.1436  function implementing :substitute has unexpected name
  2679  8.2.1437  Vim9: 'statusline' is evaluated using Vim9 script syntax
  4477  8.2.1438  missing tests for interrupting script execution from debugger
 54401  8.2.1439  tiny and small builds have no test coverage
 11974  8.2.1440  debugger code insufficiently tested
  2329  8.2.1441  running tests in tiny version gives error for summarize.vim
  7158  8.2.1442  outdated references to the Mac Carbon GUI
  2271  8.2.1443  Vim9: crash when interrupting a nested :def function
152563  8.2.1444  error messages are spread out and names can be confusing
  2875  8.2.1445  Vim9: function expanded name is cleared when sourcing again
  7799  8.2.1446  Vim9: line number in error message is not correct
  2570  8.2.1447  Vim9: return type of keys() is list<any>
  1641  8.2.1448  test 77a for VMS depends on small.vim which does not exist
  3750  8.2.1449  some test makefiles delete files that are not generated
  2153  8.2.1450  Vim9: no check that script-local items don't become global
  4595  8.2.1451  Vim9: list type at script level only uses first item
  1590  8.2.1452  Vim9: dead code in to_name_end()
  1527  8.2.1453  Vim9: failure to compile lambda not tested
  2977  8.2.1454  Vim9: failure invoking lambda with wrong arguments
  2703  8.2.1455  Vim9: crash when using typecast before constant
  2444  8.2.1456  MS-Windows: test files are not deleted
  1470  8.2.1457  Vim9: the output of :disassemble cannot be interrupted
  2902  8.2.1458  .gawk files not recognized
  2813  8.2.1459  Vim9: declaring script var in script does not infer the type
 79852  8.2.1460  error messages are spread out
 10102  8.2.1461  Vim9: string indexes are counted in bytes
 15218  8.2.1462  Vim9: string slice not supported yet
 11800  8.2.1463  Vim9: list slice not supported yet
  1467  8.2.1464  Vim9: build warning for unused variable
 14411  8.2.1465  Vim9: subscript not handled properly
 30468  8.2.1466  Vim9: cannot index or slice a variable with type "any"
  4193  8.2.1467  Vim9: :echomsg doesn't like a dict argument
  1904  8.2.1468  Vim9: invalid error for missing white space
  6317  8.2.1469  Vim9: cannot assign string to string option
  7152  8.2.1470  errors in spell file not tested
  2851  8.2.1471  :const only locks the variable, not the value
  3645  8.2.1472  ":argdel" does not work like ":.argdel" as documented
 10187  8.2.1473  items in a list given to :const can still be modified
  3480  8.2.1474  /usr/lib/udef/rules.d not recognized as udevrules
  7400  8.2.1475  Vim9: can't use v:true for option flags
  1871  8.2.1476  filetype test fails on MS-Windows
  2105  8.2.1477  Vim9: error when using bufnr('%')
  5502  8.2.1478  Vim9: cannot use "true" for some popup options
 11406  8.2.1479  Vim9: error for list index uses wrong line number
  3110  8.2.1480  Vim9: skip expression in search() gives error
 58088  8.2.1481  Vim9: line number reported with error may be wrong
  3744  8.2.1482  Vim9: crash when using a nested lambda
  1735  8.2.1483  Vim9: error for using special as number
  1766  8.2.1484  flaky failure in assert_fails()
  2103  8.2.1485  Vim9: readdirex() expression doesn't accept bool
  5543  8.2.1486  Vim9: readdir() expression doesn't accept bool
  3132  8.2.1487  Travis: installing snd-dummy is not always useful
  2920  8.2.1488  text does not scroll when inserting above first line
  4522  8.2.1489  Vim9: error when setting an option with setbufvar()
  4418  8.2.1490  Vim9: using /= with float and number doesn't work
 22374  8.2.1491  Vim9: crash when compiling heredoc lines start with comment
  7258  8.2.1492  build failures
 18371  8.2.1493  not enough test coverage for the spell file handling
  1725  8.2.1494  missing change to calling eval_getline()
  1925  8.2.1495  "make clean" may delete too many files
  2403  8.2.1496  Vim9: cannot use " #" in a mapping
  2471  8.2.1497  CursorHold test is flaky
 17887  8.2.1498  on slow systems tests can be flaky
  3027  8.2.1499  Vim9: error when using "$" with col()
  2828  8.2.1500  Vim9: error when using address without a command
  2948  8.2.1501  Vim9: concatenating to constant reverses order
  3526  8.2.1502  Vim9: can use += with a :let command at script level
  2573  8.2.1503  Vim9: error for autocmd defined in :def in legacy script
 19831  8.2.1504  Vim9: white space checks are only done for a :def function
  4800  8.2.1505  not all file read and writecode is tested
  4252  8.2.1506  Vim9: no error when using a number other than 0 or 1 as bool
  3378  8.2.1507  using malloc() directly
  5137  8.2.1508  not all debugger commands covered by tests
  1970  8.2.1509  vertical separator is cleared when dragging a popup window
  7857  8.2.1510  using "var" in :def function may refer to legacy script var
  3358  8.2.1511  putting a string in Visual block mode ignores multi-byte
  4342  8.2.1512  failure after trinary expression fails
 12861  8.2.1513  cannot interrupt shell used for filename expansion
  2152  8.2.1514  multibyte vertical separator is cleared when dragging popup
  3004  8.2.1515  Vim9: can create s:var in legacy script but cannot unlet
  2544  8.2.1516  Vim9: error for :exe has wrong line number
  6876  8.2.1517  cannot easily get the character under the cursor
  6981  8.2.1518  Vim9: cannot assign to local option
  9285  8.2.1519  Vim9: Ex command default range is not set
  2314  8.2.1520  Vim9: CTRL-] used in :def function does not work
  5392  8.2.1521  reading past end of buffer when reading spellfile
 11926  8.2.1522  not enough test coverage for the spell file handling
 19157  8.2.1523  still not enough test coverage for the spell file handling
  4193  8.2.1524  no longer get an error for string concatenation with float
  3801  8.2.1525  messages from tests were not always displayed
  1882  8.2.1526  line in testdir Makefile got commented out
  4327  8.2.1527  Vim9: cannot use a function name at script level
  4631  8.2.1528  Vim9: :endif not found after "if false"
  2787  8.2.1529  Vim9: :elseif may be compiled when not needed
  1726  8.2.1530  Vim9: test fails on MS-Windows
  1628  8.2.1531  Vim9: test still fails on MS-Windows
  1880  8.2.1532  compiler warning for conversion of size_t to long
  1998  8.2.1533  Vim9: error when passing getreginfo() result to setreg()
  4498  8.2.1534  Vim9: type error for argument type is not at call position
 14984  8.2.1535  it is not possible to specify cell widths of characters
  9002  8.2.1536  cannot get the class of a character; emoji widths are wrong
  4689  8.2.1537  memory acccess error when using setcellwidths()
  6496  8.2.1538  Python: iteration over vim objects fails to keep reference
 10388  8.2.1539  using invalid script ID causes a crash
  2845  8.2.1540  the user cannot try out emoji character widths
  4252  8.2.1541  Vim9: cannot find function reference for s:Func
  1508  8.2.1542  Vim9: test with invalid SID does not work in the GUI
  2247  8.2.1543  Vim9: test with invalid SID is skipped in the GUI
 14862  8.2.1544  cannot translate messages in a Vim script
  2602  8.2.1545  ch_logfile() is unclear about closing when forking
  5084  8.2.1546  build rule for Vim.app is unused
  8021  8.2.1547  various comment problems
  1451  8.2.1548  cannot move position of "%%" in message translations
  1866  8.2.1549  "r" fails if 'esckeys' is off and modifyOtherKeys is used
  2635  8.2.1550  Vim9: bufname('%') gives an error
 14222  8.2.1551  Vim9: error for argument type does not mention the number
  4912  8.2.1552  warnings from asan with clang-11
  2998  8.2.1553  crash in edit test
  1419  8.2.1554  crash in normal test
  5601  8.2.1555  not all tests are executed on Github Actions
  8616  8.2.1556  cursorline highlighting always overrules sign highlighting
  2480  8.2.1557  crash in :vimgrep when started as "vim -n"
  1425  8.2.1558  signs test fails
  1684  8.2.1559  s390x tests work again
  6271  8.2.1560  using NULL pointers in some code
  1819  8.2.1561  using NULL pointers in fold code
  5836  8.2.1562  Vim9: error when using "%" where a buffer is expected
  2981  8.2.1563  Vim9: error when using '%" with setbufvar() r getbufvar()
  3817  8.2.1564  a few remaining errors from ubsan
  1763  8.2.1565  spellfile test sometimes fails
  2973  8.2.1566  not all Bazel files are recognized
  4381  8.2.1567  no example to use ubsan with clang
  3061  8.2.1568  prop_find() skips properties in the same line
  2750  8.2.1569  Vim9: fixes not tested; failure in getchangelist()
  6033  8.2.1570  configure check for dirfd() does not work on HPUX
  2467  8.2.1571  Vim9: count() third argument cannot be "true"
  2746  8.2.1572  Vim9: expand() does not take "true" as argument
  2249  8.2.1573  Vim9: getreg() does not take "true" as argument
  2730  8.2.1574  Vim9: glob() doesnot take "true" as argument
  2792  8.2.1575  Vim9: globpath() doesnot take "true" as argument
  2439  8.2.1576  Vim9: index() does not take "true" as argument
  3820  8.2.1577  Vim9: hasmapto()/mapcheck()/maparg() do nottake "true" arg
  2857  8.2.1578  Vim9: popup_clear() does not take "true" as argument
  6502  8.2.1579  reports from asan are not optimal
  8609  8.2.1580  wildmenu does not work properly
  2402  8.2.1581  using line() for global popup window doesn't work
  2133  8.2.1582  the channel log does not show typed text
  2241  8.2.1583  MS-Windows: cannot easily measure code coverage
  3692  8.2.1584  Vim9: cannot use "true" for "skipstart" in prop_find()
 12469  8.2.1585  messages in globals.h not translated
  2666  8.2.1586  :resize command not fully tested
 14995  8.2.1587  loop for handling keys for the command line is too long
 12640  8.2.1588  cannot read back the prompt of a prompt buffer
  7234  8.2.1589  term_start() options for size are overruled by 'termwinsize'
  2281  8.2.1590  Vim9: bufnr() doesn't take "true" argument
  3503  8.2.1591  using winheight('.') in tests works but is wrong
  2201  8.2.1592  Vim9: passing "true" to char2nr() fails
 69418  8.2.1593  tests do not check the error number properly
  3476  8.2.1594  pull requests on github do not notify a maintainer
  9228  8.2.1595  cannot easily see what Vim sends to the terminal
  1915  8.2.1596  using win_screenpos('.') in tests works but is wrong
113105  8.2.1597  the channel source file is too big
  3066  8.2.1598  starting a hidden terminal resizes the current window
  2973  8.2.1599  missing line end when skipping a long line with :cgetfile
  2717  8.2.1600  Vim9: cannot use "true" with deepcopy()
  2131  8.2.1601  Vim9: cannot use 'true" with garbagecollect()
  2886  8.2.1602  Vim9: cannot use 'true" with getbufinfo()
  2109  8.2.1603  Vim9: cannot use "true" with getchar()
  2169  8.2.1604  Vim9: cannot use "true" with getcompletion()
  1910  8.2.1605  default maintainer on github is wrong
  1934  8.2.1606  Vim9: cannot use "true" with has()
  1373  8.2.1607  Vim9: getchar() test fails on MS-Windows
  1893  8.2.1608  Vim9: getchar() test fails with GUI
  2915  8.2.1609  Vim9: test fails when build without +channel
  2618  8.2.1610  Vim9: cannot pass "true" to list2str() and str2list()
  2185  8.2.1611  Vim9: cannot pass "true" to nr2char()
  3374  8.2.1612  Vim9: cannot pass "true" to prop_remove()
  3103  8.2.1613  Vim9: cannot pass "true" to prop_type_add()
  2892  8.2.1614  Vim9: cannot pass "true" to searchcount()
  2990  8.2.1615  Vim9: cannot pass "true" to searchdecl()
  2567  8.2.1616  Vim9: cannot pass "true" to synID()
  9673  8.2.1617  Vim9: cannot pass "true" to win_splitmove()
  2246  8.2.1618  Vim9: cannot pass "true" to setloclist()
  2221  8.2.1619  Vim9: cannot pass "true" to spellsuggest()
  1918  8.2.1620  searchcount() test fails
  1947  8.2.1621  crash when using submatch(0, 1) in substitute()
 26023  8.2.1622  loop to handle keys for the command line is too long
 50292  8.2.1623  Vim9: using :call where it is not needed
  3406  8.2.1624  Vim9: cannot pass "true" to split(), str2nr() and strchars()
  2015  8.2.1625  compiler warning for use of fptr_T
  1703  8.2.1626  test for strchars() fails with different error number
  3991  8.2.1627  Vim9: cannot pass "true" to submatch/term_gettty/term_start
  2298  8.2.1628  Vim9: cannot pass "true" to timer_paused()
  2188  8.2.1629  test fails without terminal feature
  2158  8.2.1630  terminal test fails
 14933  8.2.1631  test_fails() does not check the context of the line number
 15071  8.2.1632  not checking the context of test_fails()
  3936  8.2.1633  some error messages are internal but do not use iemsg()
 18720  8.2.1634  loop to handle keys for the command line is too long
  2274  8.2.1635  no digraph for 0x2022 BULLET
  7317  8.2.1636  get stuck if a popup filter causes an error
 12792  8.2.1637  Vim9: :put ={expr} does not work inside :def function
  3626  8.2.1638  leaking memory when popup filter function can't be called
 48586  8.2.1639  options window cannot be translated
  1291  8.2.1640  Amiga: missing header for getgrgid()
  4321  8.2.1641  Vim9: cannot use 0 or 1 where a bool is expected
  1872  8.2.1642  options test fails
  2079  8.2.1643  Vim9: :defcompile compiles dead functions
  6155  8.2.1644  Vim9: cannot assign 1 and 0 to bool at script level
  2493  8.2.1645  GTK3: icons become broken images when resized
  1917  8.2.1646  Amiga: Unnecessary #include
  4785  8.2.1647  Vim9: result of expression with && and || is not a bool
  9655  8.2.1648  Amiga: no common build file for Amiga (-like) systems
  4836  8.2.1649  GTK3: using old file chooser
 11235  8.2.1650  Vim9: result of && and || expression is not bool in script
  5608  8.2.1651  spellfile code not completely tested
 11322  8.2.1652  cannot translate lines in the options window
 12190  8.2.1653  expand('<stack>') does not include the final line number
  3925  8.2.1654  when job writes to hidden buffer current window is wrong
  2404  8.2.1655  cannot build with Strawberry Perl 5.32.0
  2097  8.2.1656  Vim9: callstack wrong if :def function calls :def function
  2787  8.2.1657  Vim9: no proper error for nested ":def!"
  3522  8.2.1658  expand('<stack>') has trailing ".."
  4186  8.2.1659  spellfile code not completely tested
 48101  8.2.1660  assert functions require passing expected as first argument
  2036  8.2.1661  cannot connect to 127.0.0.1 for host with only IPv6 addresses
 22215  8.2.1662  :mksession does not restore shared terminal buffer properly
119831  8.2.1663  options window entries cannot be translated
  6982  8.2.1664  memory leak when using :mkview with a terminal buffer
 16087  8.2.1665  cannot do fuzzy string matching
  7162  8.2.1666  the initial value of 'backupskip' can have duplicate items
 10056  8.2.1667  local function name cannot shadow a global function name
  2624  8.2.1668  Vim9: not accepting 0 or 1 as bool when type is any
  5851  8.2.1669  Vim9: memory leak when storing a value fails
  2088  8.2.1670  a couple of gcc compiler warnings
  2113  8.2.1671  Vim9: stray error for missing white space
  1401  8.2.1672  v_lock is used when it is not initialized
  2537  8.2.1673  complete_info() selected index has an invalid value
  2229  8.2.1674  Vim9: internal error when using variable that was not set
  1951  8.2.1675  MinGW: testdir makefile deletes non-existing file
  2256  8.2.1676  compiler warnings for function typecast
  5859  8.2.1677  memory access errors when calling setloclist() in autocommand
  2230  8.2.1678  crash when using ":set" after ":ownsyntax"
  7509  8.2.1679  Vim9: ":*" is not recognized as a range
  1964  8.2.1680  Vim9: line number for compare error is wrong
  8770  8.2.1681  Vim9: unnessary :call commands in tests
  4682  8.2.1682  Vim9: const works in an unexpected way
  2732  8.2.1683  Vim9: assignment test fails
  2822  8.2.1684  "gF" does not use line number after file in Visual mode
 50159  8.2.1685  Vim9: cannot declare a constant value
  3256  8.2.1686  Vim9: "const!" not sufficiently tested
  1591  8.2.1687  Vim9: out of bounds error
  5132  8.2.1688  increment/decrement removes text property
  5005  8.2.1689  'colorcolumn' doesn't show in indent
  5088  8.2.1690  text properties not adjusted for "I" in Visual block mode
 42853  8.2.1691  Vim9: list<any> is not accepted where list<number> is expected
  1444  8.2.1692  build fails because TTFLAG_STATIC is missing
  3400  8.2.1693  "hi def" does not work for cleared highlight
  1862  8.2.1694  compiler warning for loss if data
  2627  8.2.1695  Vim9: crash when using varargs type "any"
  1502  8.2.1696  unused (duplicate) macros
 36417  8.2.1697  inconsistent capitalization of error messages
 24372  8.2.1698  cannot lock a variable in legacy Vim script like in Vim9
  1364  8.2.1699  build failure due to missing error message
  2080  8.2.1700  Vim9: try/catch causes wrong value to be returned
  2672  8.2.1701  Vim9: sort("i") does not work
  2149  8.2.1702  crash when using undo after deleting folded lines
  7839  8.2.1703  ":highlight clear" does not restore default link
  4539  8.2.1704  Vim9: crash in for loop when autoload script has an error
  4708  8.2.1705  "verbose hi Name" reports incorrect info after ":hi clear"
  3124  8.2.1706  Vim9: crash after running into the "Multiple closures" error
  2399  8.2.1707  small inconsitency in highlight test
  3474  8.2.1708  Vim9: error message for function has unpritable characters
  1494  8.2.1709  Vim9: memory leak when using multiple closures
  3254  8.2.1710  Vim9: list of list type can be wrong
  5824  8.2.1711  Vim9: leaking memory when using partial
  5847  8.2.1712  Vim9: leaking memory when calling a lambda
  1711  8.2.1713  Motif GUI: crash when setting menu colors
  2333  8.2.1714  text properties corrupted with substitute command
  1795  8.2.1715  Motif GUI: commented out code missed {}
 13158  8.2.1716  options window has duplicate translations
 18954  8.2.1717  MS-Windows installer doesn't have Russian translations
  2842  8.2.1718  Vim9: :def function disallows "firstline" for no good reason
  3019  8.2.1719  Vim9: no error if comma is missing in between arguments
  2652  8.2.1720  Vim9: memory leak with heredoc that isn't executed
  1648  8.2.1721  MS-Windows installer doesn't work
  2822  8.2.1722  Vim9: cannot assign a lambda to a variable of type function
  2089  8.2.1723  Vim9: Variable argument name cannot start with underscore
 40953  8.2.1724  Vim9: assignment tests spread out
  4260  8.2.1725  not all Pascal files are recognized
 42042  8.2.1726  fuzzy matching only works on strings
  9610  8.2.1727  a popup created with "cursorline" will ignore "firstline"
  1400  8.2.1728  compiler warning for using uninitialized variable
  5370  8.2.1729  endless loop when ":normal" feeds popup window filter 
  2977  8.2.1730  Vim9: cannot use member of unknown type
  4054  8.2.1731  Vim9: cannot use += to append to empty NULL list
  6689  8.2.1732  stuck when win_execute() for a popup causes an error
  1390  8.2.1733  Vim9: memory leaks when using nested function
 16731  8.2.1734  Vim9: cannot use a funcref for a closure twice
  1905  8.2.1735  Github actions appear to timeout too soon
 11331  8.2.1736  failure to compile a pattern not tested much
  5725  8.2.1737  cursor line highlight in popup window is not always updated
  1451  8.2.1738  Mac: str2float() recognizes comma instead of decimal point
  4098  8.2.1739  Vim9: crash when compiling a manually defined function
  1659  8.2.1740  test fails without the terminal feature
 10078  8.2.1741  pathshorten() only supports using one character
  2000  8.2.1742  test still fails without the terminal feature
  4351  8.2.1743  cannot build without the eval feature
104519  8.2.1744  Vim9: using ":const!" is weird
  1317  8.2.1745  tiny version doesn't build
  3529  8.2.1746  Vim9: cannot use "fina" for "finally"
  2801  8.2.1747  result of expand() unexpectedly depends on 'completeslash'
  3130  8.2.1748  closing split window in other tab may cause a crash
  3312  8.2.1749  Vim9: crash when closure fails in nested function
 13444  8.2.1750  popup_setoptions() setting firstline fails if cursorline set
  4175  8.2.1751  using 2 where bool is expected may throw an error
  4938  8.2.1752  GTK GUI: cannot map alt-? with <A-?>
  1552  8.2.1753  Vim9: crash when using import at script level
  2679  8.2.1754  completion with spell checking not tested
  3147  8.2.1755  Vim9: crash when using invalid heredoc marker
 64184  8.2.1756  Vim9: :let will soon be disallowed
  3686  8.2.1757  Mac: default locale is lacking the encoding
  2834  8.2.1758  Vim9: type of unmaterialized list is wrong
 77029  8.2.1759  Vim9: Some tests are still using :let
  2347  8.2.1760  Vim9: crash when end marker is missing
 56518  8.2.1761  Vim9: Some tests are still using :let
  3012  8.2.1762  when a timer uses :stopinsert completion isn't stopped
  3354  8.2.1763  Vim9: cannot use "true" for popup window scrollbar option
  2267  8.2.1764  Vim9: no error when assigning to script var with wrong type
 15691  8.2.1765  Vim9: some tests use "var var"
 48362  8.2.1766  Vim9: Some tests are still using :let
  1581  8.2.1767  Vim9: test fails with python support
  5057  8.2.1768  cannot use the help menu from a terminal window
  8129  8.2.1769  popup filter interferes with using :normal to move the cursor
  2689  8.2.1770  invalid memory use when using SpellFileMissing autocmd
  4665  8.2.1771  synIDattr() cannot get the value of ctermul
  2909  8.2.1772  cannot use CTRL-W <Down> to move out of a terminal window
  1783  8.2.1773  crash when calling mapset() with a list as first argument
  1711  8.2.1774  GTK: hang when forced to exit
  3748  8.2.1775  MS-Windows: adding a long quickfix list is slow
  2260  8.2.1776  filetype.vim may be loaded twice
 10332  8.2.1777  Vim9: some assignment tests in the wrong file
  5010  8.2.1778  Vim9: returning from a partial call clears outer context
  2315  8.2.1779  some debian changelog files are not recognized
  2698  8.2.1780  statusline not updated when splitting windows
  3089  8.2.1781  writing to prompt buffer interferes with insert mode
  2053  8.2.1782  Vim9: cannot pass boolean to mapset()
  3835  8.2.1783  try-catch test fails
  4031  8.2.1784  commits are not scanned for security problems
  1781  8.2.1785  compiler warning for strcp() out of bounds
 12706  8.2.1786  various Normal mode commands not fully tested
  3698  8.2.1787  crash with 'incsearch' and very long line
  2686  8.2.1788  Vim9: still allows :let for declarations
  2949  8.2.1789  Vim9: crash with invalid list constant
  2468  8.2.1790  MS-Windows with Python: crash when executed from Vifm
  1946  8.2.1791  Vim9: debugger test fails
  2933  8.2.1792  Configure does not recognize Racket 6.1+
  4883  8.2.1793  not consistently giving the "is a directory" warning
 20303  8.2.1794  no falsy Coalescing operator
 37837  8.2.1795  Vim9: operators && and || have a confusing result
  3443  8.2.1796  Vim9: invalid memory access with weird function name
  2641  8.2.1797  Vim9: some parts of the code not tested
 20061  8.2.1798  Vim9: trinary operator condition is too permissive
 11989  8.2.1799  some Normal mode commands not fully tested
  1670  8.2.1800  Vim9: memory leak if "if" condition is invalid
  2963  8.2.1801  undo file not found when using ":args" or ":next"
  1942  8.2.1802  Vim9: crash with unterminated dict
  4105  8.2.1803  a few failures are not tested
  2042  8.2.1804  resolve('/') returns an empty string
  2417  8.2.1805  Unix: terminal mode changed when using ":shell"
  2476  8.2.1806  MS-Windows with Python: Vim freezes after import command
  2419  8.2.1807  can use :help in a terminal popup window
  2525  8.2.1808  no test coverage for ":spelldump!"
  6501  8.2.1809  mapping some keys with Ctrl does not work properly
  6325  8.2.1810  some code in normal.c not covered by tests
  5254  8.2.1811  mapping Ctrl-key does not work for '{', '}' and '|'
  3429  8.2.1812  Vim9: nested closure throws an internal error
  7815  8.2.1813  Vim9: can assign wrong type to script dict
  1589  8.2.1814  missing change to remove "static"
  3003  8.2.1815  Vim9: memory leak when using function reference
  3451  8.2.1816  Vim9: another memory leak when using function reference
  3643  8.2.1817  Vim9: wrong instruction when reusing a local variable spot
  1660  8.2.1818  SE Linux: deprecation warning for security_context_t
 12097  8.2.1819  Vim9: Memory leak when using a closure
  1580  8.2.1820  Vim9: crash when error happens in timer callback
  3469  8.2.1821  Vim9: concatenating to a NULL list doesn't work
  1830  8.2.1822  list test doesn't fail
  2554  8.2.1823  "gN" does not select the matched string
  9700  8.2.1824  Vim9: variables at the script level escape their scope
  2429  8.2.1825  Vim9: accessing freed memory
  7613  8.2.1826  Vim9: cannot use a {} block at script level
 47800  8.2.1827  filetype detection does not test enough file names
  1678  8.2.1828  build failure without the +eval feature
  2473  8.2.1829  warnings when executing Github actions
  3772  8.2.1830  MS-Windows: Python3 issue with stdin
  1427  8.2.1831  file missing from distribution
  2206  8.2.1832  readdirex() error is displayed as a message
  2252  8.2.1833  when reading from stdin dup() is called twice
  4615  8.2.1834  PyEval_InitThreads() is deprecated in Python 3.9
  5959  8.2.1835  ":help ??" finds the "!!" tag
  3776  8.2.1836  autocmd test fails on pacifist systems
  4254  8.2.1837  using "gn" after "gN" does not work
  5844  8.2.1838  Vim9: cannot insert a comment line in an expression
  3240  8.2.1839  Vim9: memory leaks reported in assign test
  4499  8.2.1840  Vim9: error message is not clear about compilation error
  1798  8.2.1841  Vim9: test for compilation error fails in normal build
  3440  8.2.1842  crash when USE_FNAME_CASE is defined and using :browse
  2121  8.2.1843  Netbeans: with huge buffer number memory allocation may fail
  3792  8.2.1844  using "q" at the more prompt doesn't stop a long message
 16660  8.2.1845  Vim9: function defined in a block can't use block variables
 30419  8.2.1846  Vim9: block variables are not found in compiled function
  1462  8.2.1847  Vim9: using negative value for unsigned type
  2526  8.2.1848  crash when passing a NULL string or list to popup_settext()
  3974  8.2.1849  Vim9: garbage collection frees block-local variables
  2961  8.2.1850  "vat" does not select tags correctly over line break
  3690  8.2.1851  Vim9: "!" followed by space incorrectly used
  3705  8.2.1852  map() returing zero for NULL list is unexpected
  2186  8.2.1853  "to_f" is recognized at "topleft" modifier
  2954  8.2.1854  Vim9: crash when throwing exception for NULL string
  3963  8.2.1855  Vim9: get error message when nothing is wrong
  2709  8.2.1856  "2resize" uses size of current window
  2427  8.2.1857  Vim9: using job_status() on an unused var gives an error
  4524  8.2.1858  Vim9: filter functions return number instead of bool
  4184  8.2.1859  Vim9: crash in unpack assignment
  1340  8.2.1860  Vim9: memory leak when throwing empty string
  4284  8.2.1861  Vim9: no specific error when parsing lambda fails
  1381  8.2.1862  vim9: memory leak when compiling lambda fails
  3537  8.2.1863  json code not sufficiently tested
 19569  8.2.1864  Vim9: no error for wrong list type
  9162  8.2.1865  Vim9: add() does not check type of argument
  1960  8.2.1866  Vim9: appending to pushed blob gives wrong result
  7800  8.2.1867  Vim9: argument to add() not checked for blob
  2028  8.2.1868  Vim9: no error for missing space after comma in dict
  1338  8.2.1869  Vim9: memory leak when using add()
 10627  8.2.1870  Vim9: no need to keep all script variables
  2653  8.2.1871  using %v in 'errorformat' may fail before %Z
  6549  8.2.1872  matchfuzzy() does not prefer sequential matches
  2219  8.2.1873  Vim9: missing white space when using <f-args>
  7151  8.2.1874  can't do something just before leaving Insert mode
  1942  8.2.1875  warning when building GTK gui
111920  8.2.1876  Vim9: argument types are not checked at compile time
  4573  8.2.1877  test for function list fails
 29348  8.2.1878  GTK: error for redefining function
  8707  8.2.1879  Vim9: argument types of insert() not checked when compiling
  2033  8.2.1880  Vim9: asan complains about adding zero to NULL
  4763  8.2.1881  cannot build with GTK3
  3503  8.2.1882  Vim9: v:disallow_let is no longer needed
 20554  8.2.1883  compiler warnings when using Python
  2445  8.2.1884  compiler warning for uninitialized variable
  1506  8.2.1885  filetype tests unnessarily creates swap files
  3335  8.2.1886  using ":silent!" in a popup filter has unexpected effect
  1607  8.2.1887  Github actions not optimally configured
  2545  8.2.1888  Vim9: getbufline(-1, 1, '$') gives an error
  1974  8.2.1889  Vim9: errornous error for missing white space after {}
  3698  8.2.1890  Vim9: strange error for subtracting from a list
  6461  8.2.1891  Vim9: skipping over expression doesn't handle line breaks
  1809  8.2.1892  valgrind warns for using uninitialized access in tests
 30521  8.2.1893  fuzzy matching does not support multiple words
  8705  8.2.1894  Vim9: command modifiers are not supported
  1452  8.2.1895  Vim9: silent command modifier test fails
  1997  8.2.1896  valgrind warns for using uninitialized memory
 16058  8.2.1897  command modifiers are saved and set inconsistently
 95041  8.2.1898  command modifier parsing always uses global cmdmod
  1524  8.2.1899  crash in out-of-memory situation
 19086  8.2.1900  Vim9: command modifiers do not work
  3666  8.2.1901  variable completion does not work in command line window
  2177  8.2.1902  default option values changed with :badd for existing buffer
  1708  8.2.1903  buffer test fails with normal features
  6966  8.2.1904  still using default option values after using ":badd +1"
  3500  8.2.1905  the wininfo list may contain stale entries
  2973  8.2.1906  warning for signed/unsigned
  6757  8.2.1907  complete_info().selected may be wrong
  3381  8.2.1908  Lua is initialized even when not used
 26399  8.2.1909  number of status line items is limited to 80
  2258  8.2.1910  reading past the end of the command line
  1811  8.2.1911  tiny build fails
  3038  8.2.1912  with Python 3.9 some tests fail
  2108  8.2.1913  GTK GUI: rounding for the cell height is too strict
  8479  8.2.1914  Vim9: cannot put line break in expression for '=' register
  2739  8.2.1915  Vim9: error for wrong number of arguments is not useful
  3525  8.2.1916  Vim9: function call is aborted even when "silent!" is used
  1598  8.2.1917  no test for improved Man command
  2506  8.2.1918  Vim9: E1100 mentions :let
 16311  8.2.1919  assert_fails() setting emsg_silent changes normal execution
  1808  8.2.1920  listlbr test fails when run after another test
  3900  8.2.1921  fuzzy matching does not recognize path separators
  5441  8.2.1922  Win32: scrolling problems when part of window is off-screen
  2326  8.2.1923  Vim9: "filter" command modifier doesn't work
  3346  8.2.1924  Vim9: crash when indexing dict with NULL key
  1730  8.2.1925  list/dict test fails
  2713  8.2.1926  cannot use a space in 'spellfile'
  5121  8.2.1927  Vim9: get unknown error with an error in a timer function
  2557  8.2.1928  Vim9: "silent!" not effective when list index is wrong
  1938  8.2.1929  MS-Windows: problem loading Perl 5.32
  3202  8.2.1930  wrong input if removing shift results in special key code
  6643  8.2.1931  Vim9: arguments of extend() not checked at compile time
  4812  8.2.1932  compiler warnings when building with Athena GUI
 10348  8.2.1933  cannot sort using locale ordering
  7141  8.2.1934  Vim9: command modifiers in :def function not tested
  3907  8.2.1935  sort test fails on Mac
  3009  8.2.1936  session sets the local 'scrolloff' value to the global value
  2812  8.2.1937  Vim9: test for confirm modifier fails in some situations
  3467  8.2.1938  wiping out a terminal buffer makes some tests fail
  2855  8.2.1939  invalid memory access in Ex mode with global command
  1542  8.2.1940  Vim9: browse modifier test fails on Mac
  1400  8.2.1941  Ex mode test fails on MS-Windows with GUI
 18853  8.2.1942  insufficient test coverage for the Netbeans interface
  2586  8.2.1943  Vim9: wrong error message when colon is missing
  1746  8.2.1944  Netbeans test is flaky
  2689  8.2.1945  crash when passing NULL function to reduce()
  4154  8.2.1946  sort() with NULL string not tested
  1840  8.2.1947  crash when using "zj" without folds
  3239  8.2.1948  GUI: crash when handling message while closing a window
  5647  8.2.1949  Vim9: using extend() on null dict is silently ignored
  3472  8.2.1950  Vim9: crash when compiling function fails when getting type
  8017  8.2.1951  test for list and dict fails
  2974  8.2.1952  Vim9: crash when using a NULL dict key
  7241  8.2.1953  Vim9: extra "unknown" error after other error
  3443  8.2.1954  Vim9: not all command modifiers are tested
  3207  8.2.1955  Vim9: not all command modifiers are tested
 20070  8.2.1956  Vim9: cannot specify argument types for lambda
  8821  8.2.1957  diff and cursorcolumn highlighting don't mix
  1787  8.2.1958  build failure with timers
  4620  8.2.1959  crash when terminal buffer name is made empty
  1615  8.2.1960  warning for uninitialized variable
  3964  8.2.1961  various comments can be improved
  5973  8.2.1962  netbeans may access freed memory
  4665  8.2.1963  crash when using a popup window with "latin1" encoding
  2917  8.2.1964  not all ConTeXt files are recognized
  4962  8.2.1965  Vim9: tests fail without the channel feature
  8595  8.2.1966  popup becomes current window after closing a terminal window
 13352  8.2.1967  the session file does not restore the alternate file
  7333  8.2.1968  Vim9: has() assumes a feature does not change dynamically
 21150  8.2.1969  Vim9: map() may change the list or dict item type
  5264  8.2.1970  it is easy to make mistakes when cleaning up swap files
  1788  8.2.1971  memory leak when map() fails
  1887  8.2.1972  crash when recreating nested fold
  2152  8.2.1973  finding a patch number can be a bit slow
  2000  8.2.1974  Vim9: test for has('gui_running') fails with VIMDLL
  1448  8.2.1975  Win32: memory leak when encoding conversion fails
  2581  8.2.1976  cannot backspace in prompt buffer after using cursor-left
 15914  8.2.1977  Vim9: error for using a string in a condition is confusing
 33294  8.2.1978  making a mapping work in all modes is complicated
  3592  8.2.1979  "term_opencmd" option of term_start() is truncated
 56846  8.2.1980  Vim9: some tests are not done at the script level
  2115  8.2.1981  MinGW: parallel compilation might fail
  2653  8.2.1982  quickfix window not updated when adding invalid entries
  4506  8.2.1983  ml_get error when using <Cmd> to open a terminal
  5364  8.2.1984  cannot use :vimgrep in omni completion
  2853  8.2.1985  crash when closing terminal popup with <Cmd> mapping
  2317  8.2.1986  expression test is flaky on Appveyor
  3405  8.2.1987  MS-Windows: Win32.mak is no longer needed
  2472  8.2.1988  still in Insert mode when opening terminal popup
  2469  8.2.1989  info popup triggers WinEnter and WinLeave autocommands
  8043  8.2.1990  cursor position wrong in terminal popup with finished job
  1597  8.2.1991  Coverity warns for not using the ga_grow() return value
  1336  8.2.1992  build fails with small features
  2212  8.2.1993  occasional failure of the netbeans test
  3411  8.2.1994  MS-Windows: MinGW always does a full build
  2430  8.2.1995  the popup menu can cause too much redrawing
  7473  8.2.1996  Vim9: invalid error for argument of extend()
  2593  8.2.1997  window changes when using bufload() while in a terminal popup
  2013  8.2.1998  terminal Cmd test sometimes fails to close popup
  1752  8.2.1999  terminal popup test sometimes fails
  4364  8.2.2000  Vim9: dict.key assignment not implemented yet
  7485  8.2.2001  Vim9: :def function does not apply 'maxfuncdepth'
  2977  8.2.2002  Vim9: lambda argument shadowed by function name
  2078  8.2.2003  build error with +conceal but without +popupwin
  1593  8.2.2004  compiler warning for uninitialized variable
  4290  8.2.2005  redoing a mapping with <Cmd> doesn't work properly
  2377  8.2.2006  .pbtxt files are not recognized
  1698  8.2.2007  test for insert mode in popup is not reliable
  2829  8.2.2008  MS-Windows GUI: handling channel messages lags
  7230  8.2.2009  MS-Windows: setting $LANG in gvimext only causes problems
  3691  8.2.2010  Vim9: compiling fails for unreachable return statement
  4012  8.2.2011  "syn sync" reports a very large number
  3197  8.2.2012  Vim9: confusing error message when using bool wrongly
  2637  8.2.2013  Vim9: not skipping white space after unary minus
  2947  8.2.2014  using CTRL-O in a prompt buffer moves cursor to start
 11901  8.2.2015  Vim9: literal dict #{} is not like any other language
  2285  8.2.2016  swap file test is a little flaky
  2665  8.2.2017  missing part of the dict change
  2618  8.2.2018  Vim9: script variable not found from lambda
  2447  8.2.2019  swap file test fails on MS-Windows
  3444  8.2.2020  some compilers do not like the "namespace" argument
  6671  8.2.2021  Vim9: get E1099 when autocommand resets did_emsg
  2206  8.2.2022  Vim9: star command recognized errornously
  1600  8.2.2023  Vim: memory leak when :execute fails
  6790  8.2.2024  flicker when redrawing a popup with a title and border
  1744  8.2.2025  Amiga: Not all colors are used on OS4
  1405  8.2.2026  Coverity warns for possibly using not NUL terminated string
  1278  8.2.2027  Coverity warns for uninitialized field
  1504  8.2.2028  Coverity warns for using an uninitialized variable
  1656  8.2.2029  Coverity warns for not checking return value
  4680  8.2.2030  some tests fail on Mac
  9065  8.2.2031  some tests fail when run under valgrind
  5059  8.2.2032  cabalconfig and cabalproject filetypes not recognized
  8734  8.2.2033  Vim9: :def without argument gives compilation error
 16763  8.2.2034  Vim9: list unpack in for statement not compiled yet
  3305  8.2.2035  MS-Windows: some tests may fail
  4133  8.2.2036  buffer messed up if creating the quickfix window fails
  3034  8.2.2037  compiler test depends on list of compiler plugins
  1646  8.2.2038  compiler test fails on MS-Windows
  3068  8.2.2039  viminfo is not written when creating a new file
  2724  8.2.2040  terminal buffer disappears even when 'bufhidden' is "hide"
  3631  8.2.2041  haskell filetype not optimally recognized
  2005  8.2.2042  build failure with +profile but without +reltime
  1935  8.2.2043  GTK3: white border around text stands out
  4224  8.2.2044  MS-Windows: swap file test sometimes fails
  5308  8.2.2045  highlighting a character too much with incsearch
  5626  8.2.2046  some test failures don't give a clear error
  1679  8.2.2047  Amiga: FEAT_ARP defined when it should not
  1626  8.2.2048  Amiga: obsolete code
  1825  8.2.2049  Amiga: obsolete function
  3205  8.2.2050  search test contains unneeded sleeps
  3906  8.2.2051  Vim9: crash when aborting a user function call
  8652  8.2.2052  Vim9: "edit +4 fname" gives an error
  2406  8.2.2053  Vim9: lamba doesn't accept argument types
  1909  8.2.2054  Amiga: FEAT_ARP defined when it should not
  2602  8.2.2055  MS-Windows: two Vim instances may use the same temp file
  2551  8.2.2056  configure fails if building with implicit-function-declaration
  4833  8.2.2057  getting the selection may trigger TextYankPost autocmd
  5332  8.2.2058  using mkview/loadview changes the jumplist
  2876  8.2.2059  Amiga: can't find plugins
  5234  8.2.2060  check for features implemented with "if"
  3155  8.2.2061  Vim9: E1030 error when using empty string for term_sendkeys()
  2147  8.2.2062  <Cmd> does not handle CTRL-V
 10981  8.2.2063  Vim9: only one level of indexing supported
  5127  8.2.2064  terminal: cursor is on while redrawing, causing flicker
  5826  8.2.2065  using map() and filter() on a range() is inefficient
  3767  8.2.2066  Vim9: assignment with += doesn't work
  3220  8.2.2067  cursor position in popup terminal is wrong
  5544  8.2.2068  transparent syntax item uses start/end of containing region
  5202  8.2.2069  the quickfix window is not updated after setqflist()
  6598  8.2.2070  can't get the exit value in VimLeave(Pre) autocommands
  3541  8.2.2071  Vim9: list assign doesn't except empty remainder list
  3533  8.2.2072  Vim9: list assign not well tested
 22348  8.2.2073  Vim9: for with unpack only works for local variables
  3523  8.2.2074  Vim9: using :normal from Vim9 script can't handle range
  3325  8.2.2075  error for const argument to mapnew()
  2718  8.2.2076  MS-Windows console: sometimes drops typed characters
  3278  8.2.2077  build failure with small features
  2426  8.2.2078  illegal memory access when using :print on invalid text
  2818  8.2.2079  Vim9: cannot put a linebreak before or after "in" of ":for"
  2397  8.2.2080  Vim9: no proper error message for using s:var in for loop
  3607  8.2.2081  Vim9: cannot handle a linebreak after "=" in assignment
 67573  8.2.2082  Vim9: can still use the depricated #{} dict syntax
  3423  8.2.2083  Vim9: crash when using ":silent!" and getting member fails

Icon  Name                          Last modified      Size  
[DIR] Parent Directory - [TXT] 8.2.0001 13-Dec-2019 18:27 1.5K [   ] 8.2.0002 13-Dec-2019 19:37 2.4K [TXT] 8.2.0003 14-Dec-2019 16:19 16K [TXT] 8.2.0004 14-Dec-2019 16:19 16K [TXT] 8.2.0005 14-Dec-2019 17:26 4.0K [TXT] 8.2.0006 14-Dec-2019 17:56 1.8K [TXT] 8.2.0007 14-Dec-2019 19:27 4.6K [   ] 8.2.0008 14-Dec-2019 20:35 11K [   ] 8.2.0009 15-Dec-2019 12:55 3.9K [   ] 8.2.0010 15-Dec-2019 13:40 86K [TXT] 8.2.0011 15-Dec-2019 14:56 5.0K [   ] 8.2.0012 15-Dec-2019 18:10 3.3K [TXT] 8.2.0013 16-Dec-2019 17:11 17K [   ] 8.2.0014 16-Dec-2019 22:44 27K [   ] 8.2.0015 17-Dec-2019 20:36 4.6K [   ] 8.2.0016 17-Dec-2019 20:36 1.7K [   ] 8.2.0017 17-Dec-2019 21:28 48K [   ] 8.2.0018 17-Dec-2019 22:11 2.6K [   ] 8.2.0019 17-Dec-2019 22:41 2.9K [TXT] 8.2.0020 18-Dec-2019 19:37 15K [TXT] 8.2.0021 18-Dec-2019 20:11 3.4K [TXT] 8.2.0022 18-Dec-2019 21:34 2.0K [   ] 8.2.0023 18-Dec-2019 22:27 8.2K [   ] 8.2.0024 19-Dec-2019 16:03 2.1K [TXT] 8.2.0025 20-Dec-2019 19:23 1.7K [TXT] 8.2.0026 21-Dec-2019 18:26 285K [TXT] 8.2.0027 21-Dec-2019 18:48 21K [   ] 8.2.0028 21-Dec-2019 22:01 9.6K [   ] 8.2.0029 21-Dec-2019 22:23 3.2K [TXT] 8.2.0030 22-Dec-2019 15:38 3.9K [   ] 8.2.0031 22-Dec-2019 16:10 2.5K [   ] 8.2.0032 22-Dec-2019 18:30 2.8K [   ] 8.2.0033 22-Dec-2019 19:41 1.8K [   ] 8.2.0034 23-Dec-2019 18:20 1.8K [TXT] 8.2.0035 23-Dec-2019 23:00 18K [   ] 8.2.0036 24-Dec-2019 15:18 3.1K [TXT] 8.2.0037 24-Dec-2019 15:44 1.4K [   ] 8.2.0038 25-Dec-2019 13:38 7.6K [TXT] 8.2.0039 25-Dec-2019 13:56 2.6K [   ] 8.2.0040 25-Dec-2019 14:00 1.7K [TXT] 8.2.0041 25-Dec-2019 14:14 2.3K [   ] 8.2.0042 25-Dec-2019 15:13 1.9K [   ] 8.2.0043 25-Dec-2019 15:47 1.8K [TXT] 8.2.0044 25-Dec-2019 18:15 16K [   ] 8.2.0045 25-Dec-2019 19:34 5.2K [   ] 8.2.0046 27-Dec-2019 13:50 9.3K [TXT] 8.2.0047 27-Dec-2019 13:50 6.8K [   ] 8.2.0048 27-Dec-2019 17:16 1.8K [TXT] 8.2.0049 27-Dec-2019 17:21 6.5K [TXT] 8.2.0050 27-Dec-2019 17:34 3.7K [   ] 8.2.0051 28-Dec-2019 14:07 1.9K [   ] 8.2.0052 28-Dec-2019 17:11 5.8K [TXT] 8.2.0053 29-Dec-2019 13:44 2.4K [   ] 8.2.0054 29-Dec-2019 13:57 6.5K [TXT] 8.2.0055 29-Dec-2019 15:21 2.3K [   ] 8.2.0056 29-Dec-2019 23:05 61K [TXT] 8.2.0057 29-Dec-2019 23:54 2.6K [TXT] 8.2.0058 30-Dec-2019 00:09 1.8K [TXT] 8.2.0059 30-Dec-2019 10:59 1.7K [TXT] 8.2.0060 30-Dec-2019 17:58 2.3K [TXT] 8.2.0061 30-Dec-2019 19:21 1.9K [TXT] 8.2.0062 30-Dec-2019 20:00 1.6K [TXT] 8.2.0063 30-Dec-2019 20:43 1.7K [   ] 8.2.0064 30-Dec-2019 22:00 6.2K [TXT] 8.2.0065 30-Dec-2019 22:34 3.9K [TXT] 8.2.0066 31-Dec-2019 19:29 7.5K [TXT] 8.2.0067 31-Dec-2019 21:28 11K [   ] 8.2.0068 31-Dec-2019 22:00 2.1K [TXT] 8.2.0069 31-Dec-2019 22:37 15K [   ] 8.2.0070 01-Jan-2020 15:05 2.1K [TXT] 8.2.0071 01-Jan-2020 15:18 2.5K [TXT] 8.2.0072 01-Jan-2020 15:27 1.6K [TXT] 8.2.0073 01-Jan-2020 15:47 5.3K [TXT] 8.2.0074 01-Jan-2020 17:10 4.0K [TXT] 8.2.0075 01-Jan-2020 17:10 1.7K [   ] 8.2.0076 01-Jan-2020 17:45 1.7K [TXT] 8.2.0077 02-Jan-2020 14:02 6.4K [TXT] 8.2.0078 02-Jan-2020 14:32 2.7K [   ] 8.2.0079 02-Jan-2020 22:58 1.5K [TXT] 8.2.0080 02-Jan-2020 22:58 3.9K [TXT] 8.2.0081 03-Jan-2020 19:13 2.0K [   ] 8.2.0082 03-Jan-2020 21:00 2.4K [   ] 8.2.0083 03-Jan-2020 21:26 4.1K [   ] 8.2.0084 04-Jan-2020 14:34 19K [TXT] 8.2.0085 04-Jan-2020 16:14 3.8K [TXT] 8.2.0086 04-Jan-2020 19:01 2.7K [   ] 8.2.0087 05-Jan-2020 14:43 4.2K [TXT] 8.2.0088 05-Jan-2020 21:52 16K [   ] 8.2.0089 05-Jan-2020 22:07 1.9K [TXT] 8.2.0090 05-Jan-2020 22:11 1.6K [TXT] 8.2.0091 06-Jan-2020 19:59 1.8K [   ] 8.2.0092 06-Jan-2020 21:04 8.1K [TXT] 8.2.0093 06-Jan-2020 21:04 2.2K [TXT] 8.2.0094 06-Jan-2020 21:23 1.5K [TXT] 8.2.0095 06-Jan-2020 21:48 4.4K [   ] 8.2.0096 06-Jan-2020 23:09 13K [   ] 8.2.0097 07-Jan-2020 20:12 2.8K [   ] 8.2.0098 07-Jan-2020 21:00 9.2K [   ] 8.2.0099 07-Jan-2020 21:12 2.3K [TXT] 8.2.0100 07-Jan-2020 21:33 33K [   ] 8.2.0101 08-Jan-2020 18:57 2.3K [   ] 8.2.0102 08-Jan-2020 19:28 1.6K [   ] 8.2.0103 08-Jan-2020 19:32 3.8K [   ] 8.2.0104 08-Jan-2020 20:09 2.5K [TXT] 8.2.0105 08-Jan-2020 21:43 6.5K [   ] 8.2.0106 09-Jan-2020 16:32 8.6K [TXT] 8.2.0107 09-Jan-2020 16:32 1.6K [   ] 8.2.0108 09-Jan-2020 21:03 5.0K [TXT] 8.2.0109 09-Jan-2020 21:36 5.4K [   ] 8.2.0110 10-Jan-2020 19:57 16K [   ] 8.2.0111 11-Jan-2020 16:06 22K [TXT] 8.2.0112 12-Jan-2020 13:54 2.2K [   ] 8.2.0113 12-Jan-2020 15:47 3.8K [TXT] 8.2.0114 12-Jan-2020 17:43 9.7K [TXT] 8.2.0115 13-Jan-2020 20:41 5.0K [TXT] 8.2.0116 13-Jan-2020 20:55 4.6K [   ] 8.2.0117 14-Jan-2020 19:06 2.3K [   ] 8.2.0118 14-Jan-2020 20:43 5.4K [   ] 8.2.0119 14-Jan-2020 22:03 1.8K [TXT] 8.2.0120 15-Jan-2020 20:38 4.1K [TXT] 8.2.0121 15-Jan-2020 20:52 4.2K [TXT] 8.2.0122 16-Jan-2020 19:41 8.2K [TXT] 8.2.0123 17-Jan-2020 18:59 3.9K [   ] 8.2.0124 17-Jan-2020 19:12 1.9K [TXT] 8.2.0125 17-Jan-2020 19:33 6.3K [   ] 8.2.0126 17-Jan-2020 21:01 1.6K [   ] 8.2.0127 18-Jan-2020 15:07 3.1K [   ] 8.2.0128 18-Jan-2020 15:54 12K [TXT] 8.2.0129 18-Jan-2020 16:12 4.4K [   ] 8.2.0130 19-Jan-2020 13:58 2.9K [TXT] 8.2.0131 19-Jan-2020 20:18 4.0K [TXT] 8.2.0132 19-Jan-2020 20:18 3.1K [TXT] 8.2.0133 20-Jan-2020 20:34 2.4K [   ] 8.2.0134 20-Jan-2020 20:42 4.3K [TXT] 8.2.0135 20-Jan-2020 21:13 2.2K [TXT] 8.2.0136 20-Jan-2020 21:33 1.8K [TXT] 8.2.0137 20-Jan-2020 21:45 3.2K [TXT] 8.2.0138 20-Jan-2020 22:00 2.2K [TXT] 8.2.0139 20-Jan-2020 22:06 2.0K [TXT] 8.2.0140 21-Jan-2020 22:14 9.7K [   ] 8.2.0141 22-Jan-2020 22:11 2.6K [   ] 8.2.0142 23-Jan-2020 15:34 5.4K [   ] 8.2.0143 23-Jan-2020 15:49 1.7K [   ] 8.2.0144 23-Jan-2020 16:20 13K [   ] 8.2.0145 23-Jan-2020 16:52 2.7K [   ] 8.2.0146 23-Jan-2020 20:01 3.2K [   ] 8.2.0147 23-Jan-2020 20:58 4.7K [TXT] 8.2.0148 24-Jan-2020 20:22 7.9K [TXT] 8.2.0149 26-Jan-2020 15:57 534K [TXT] 8.2.0150 26-Jan-2020 16:50 2.9K [TXT] 8.2.0151 26-Jan-2020 17:39 5.8K [TXT] 8.2.0152 26-Jan-2020 18:36 2.3K [   ] 8.2.0153 26-Jan-2020 18:57 2.1K [TXT] 8.2.0154 26-Jan-2020 19:29 21K [TXT] 8.2.0155 26-Jan-2020 21:43 5.6K [TXT] 8.2.0156 26-Jan-2020 22:07 35K [TXT] 8.2.0157 26-Jan-2020 22:07 1.8K [TXT] 8.2.0158 26-Jan-2020 22:44 8.2K [TXT] 8.2.0159 27-Jan-2020 22:11 19K [   ] 8.2.0160 27-Jan-2020 22:38 1.9K [   ] 8.2.0161 27-Jan-2020 22:47 2.6K [TXT] 8.2.0162 27-Jan-2020 23:02 1.7K [   ] 8.2.0163 28-Jan-2020 20:49 2.7K [   ] 8.2.0164 28-Jan-2020 22:31 6.6K [   ] 8.2.0165 28-Jan-2020 22:31 1.5K [   ] 8.2.0166 28-Jan-2020 22:40 1.7K [TXT] 8.2.0167 28-Jan-2020 22:47 2.0K [   ] 8.2.0168 28-Jan-2020 22:53 1.9K [   ] 8.2.0169 28-Jan-2020 23:01 1.5K [TXT] 8.2.0170 28-Jan-2020 23:04 2.4K [TXT] 8.2.0171 28-Jan-2020 23:10 1.5K [TXT] 8.2.0172 28-Jan-2020 23:14 1.9K [TXT] 8.2.0173 29-Jan-2020 21:28 28K [TXT] 8.2.0174 29-Jan-2020 22:00 15K [TXT] 8.2.0175 29-Jan-2020 22:18 2.9K [TXT] 8.2.0176 29-Jan-2020 22:31 1.4K [TXT] 8.2.0177 29-Jan-2020 22:39 1.5K [TXT] 8.2.0178 30-Jan-2020 11:54 4.2K [   ] 8.2.0179 30-Jan-2020 15:01 17K [TXT] 8.2.0180 30-Jan-2020 16:10 1.7K [   ] 8.2.0181 30-Jan-2020 16:28 17K [TXT] 8.2.0182 30-Jan-2020 16:40 2.2K [TXT] 8.2.0183 30-Jan-2020 18:25 59K [TXT] 8.2.0184 30-Jan-2020 19:39 1.6K [TXT] 8.2.0185 31-Jan-2020 20:11 16K [   ] 8.2.0186 31-Jan-2020 21:14 2.3K [   ] 8.2.0187 31-Jan-2020 21:21 1.8K [TXT] 8.2.0188 31-Jan-2020 22:13 8.3K [   ] 8.2.0189 31-Jan-2020 22:42 2.0K [TXT] 8.2.0190 31-Jan-2020 22:59 2.5K [   ] 8.2.0191 01-Feb-2020 22:19 31K [TXT] 8.2.0192 01-Feb-2020 22:19 3.5K [   ] 8.2.0193 01-Feb-2020 22:40 1.9K [   ] 8.2.0194 01-Feb-2020 23:05 11K [TXT] 8.2.0195 02-Feb-2020 13:53 2.8K [TXT] 8.2.0196 02-Feb-2020 15:26 5.2K [   ] 8.2.0197 02-Feb-2020 15:33 10K [   ] 8.2.0198 02-Feb-2020 15:56 3.1K [   ] 8.2.0199 02-Feb-2020 17:23 5.7K [TXT] 8.2.0200 02-Feb-2020 22:25 26K [   ] 8.2.0201 03-Feb-2020 20:51 18K [TXT] 8.2.0202 03-Feb-2020 21:30 1.4K [   ] 8.2.0203 03-Feb-2020 21:40 11K [   ] 8.2.0204 03-Feb-2020 22:16 3.3K [TXT] 8.2.0205 03-Feb-2020 22:59 2.1K [   ] 8.2.0206 04-Feb-2020 21:25 4.1K [TXT] 8.2.0207 04-Feb-2020 21:55 4.6K [TXT] 8.2.0208 04-Feb-2020 22:23 6.8K [   ] 8.2.0209 04-Feb-2020 22:33 4.7K [TXT] 8.2.0210 04-Feb-2020 23:09 1.7K [   ] 8.2.0211 05-Feb-2020 20:12 2.7K [   ] 8.2.0212 05-Feb-2020 20:40 9.9K [TXT] 8.2.0213 05-Feb-2020 20:45 3.4K [   ] 8.2.0214 05-Feb-2020 21:14 4.5K [   ] 8.2.0215 05-Feb-2020 21:14 2.6K [   ] 8.2.0216 05-Feb-2020 22:10 5.2K [   ] 8.2.0217 05-Feb-2020 22:21 1.8K [   ] 8.2.0218 05-Feb-2020 22:56 6.5K [TXT] 8.2.0219 05-Feb-2020 23:02 2.1K [TXT] 8.2.0220 06-Feb-2020 11:55 2.0K [   ] 8.2.0221 06-Feb-2020 13:16 3.2K [TXT] 8.2.0222 06-Feb-2020 17:52 16K [   ] 8.2.0223 06-Feb-2020 19:26 19K [   ] 8.2.0224 06-Feb-2020 20:40 5.5K [   ] 8.2.0225 06-Feb-2020 21:27 4.7K [   ] 8.2.0226 06-Feb-2020 22:07 3.7K [   ] 8.2.0227 06-Feb-2020 22:41 3.8K [TXT] 8.2.0228 07-Feb-2020 20:51 2.8K [   ] 8.2.0229 07-Feb-2020 22:10 12K [   ] 8.2.0230 07-Feb-2020 22:21 1.8K [TXT] 8.2.0231 08-Feb-2020 14:23 1.9K [TXT] 8.2.0232 08-Feb-2020 16:01 2.6K [TXT] 8.2.0233 08-Feb-2020 16:41 13K [   ] 8.2.0234 08-Feb-2020 17:15 2.5K [TXT] 8.2.0235 08-Feb-2020 18:41 2.9K [TXT] 8.2.0236 10-Feb-2020 22:07 1.7K [TXT] 8.2.0237 10-Feb-2020 20:34 2.2K [   ] 8.2.0238 10-Feb-2020 21:33 2.7K [TXT] 8.2.0239 10-Feb-2020 22:07 3.0K [TXT] 8.2.0240 10-Feb-2020 22:45 3.8K [   ] 8.2.0241 10-Feb-2020 22:57 2.0K [   ] 8.2.0242 11-Feb-2020 21:45 2.1K [   ] 8.2.0243 11-Feb-2020 22:04 22K [TXT] 8.2.0244 11-Feb-2020 22:38 1.9K [TXT] 8.2.0245 11-Feb-2020 22:50 1.7K [TXT] 8.2.0246 11-Feb-2020 23:02 5.2K [TXT] 8.2.0247 12-Feb-2020 21:04 1.8K [TXT] 8.2.0248 12-Feb-2020 21:16 5.4K [TXT] 8.2.0249 12-Feb-2020 21:53 2.6K [TXT] 8.2.0250 12-Feb-2020 22:28 7.0K [   ] 8.2.0251 12-Feb-2020 22:28 4.0K [   ] 8.2.0252 13-Feb-2020 20:32 2.0K [   ] 8.2.0253 13-Feb-2020 21:30 3.4K [   ] 8.2.0254 13-Feb-2020 21:43 1.7K [TXT] 8.2.0255 13-Feb-2020 22:03 2.6K [   ] 8.2.0256 14-Feb-2020 13:23 67K [TXT] 8.2.0257 14-Feb-2020 14:33 8.3K [   ] 8.2.0258 14-Feb-2020 16:54 5.9K [TXT] 8.2.0259 15-Feb-2020 00:01 2.9K [TXT] 8.2.0260 15-Feb-2020 23:08 16K [   ] 8.2.0261 16-Feb-2020 13:35 11K [TXT] 8.2.0262 16-Feb-2020 15:05 1.6K [TXT] 8.2.0263 16-Feb-2020 15:05 3.1K [TXT] 8.2.0264 16-Feb-2020 15:10 1.8K [   ] 8.2.0265 16-Feb-2020 16:23 1.9K [TXT] 8.2.0266 16-Feb-2020 17:05 1.4K [   ] 8.2.0267 16-Feb-2020 19:44 2.1K [   ] 8.2.0268 17-Feb-2020 10:02 1.7K [TXT] 8.2.0269 17-Feb-2020 21:12 2.8K [   ] 8.2.0270 17-Feb-2020 21:34 24K [TXT] 8.2.0271 17-Feb-2020 22:13 14K [   ] 8.2.0272 17-Feb-2020 22:40 5.4K [TXT] 8.2.0273 17-Feb-2020 22:54 3.6K [TXT] 8.2.0274 18-Feb-2020 21:33 2.8K [   ] 8.2.0275 18-Feb-2020 21:55 7.9K [TXT] 8.2.0276 19-Feb-2020 12:42 3.4K [   ] 8.2.0277 19-Feb-2020 14:20 4.9K [   ] 8.2.0278 19-Feb-2020 14:32 1.9K [   ] 8.2.0279 19-Feb-2020 15:48 2.1K [   ] 8.2.0280 19-Feb-2020 17:06 2.1K [TXT] 8.2.0281 19-Feb-2020 17:13 4.7K [   ] 8.2.0282 19-Feb-2020 18:15 4.0K [   ] 8.2.0283 19-Feb-2020 20:23 3.6K [TXT] 8.2.0284 19-Feb-2020 21:13 1.5K [TXT] 8.2.0285 19-Feb-2020 22:32 6.6K [TXT] 8.2.0286 20-Feb-2020 20:13 7.2K [TXT] 8.2.0287 20-Feb-2020 20:41 2.9K [TXT] 8.2.0288 20-Feb-2020 22:15 8.0K [TXT] 8.2.0289 20-Feb-2020 22:18 1.4K [   ] 8.2.0290 20-Feb-2020 22:36 2.4K [   ] 8.2.0291 20-Feb-2020 22:55 7.8K [   ] 8.2.0292 20-Feb-2020 23:09 2.2K [   ] 8.2.0293 21-Feb-2020 17:55 14K [TXT] 8.2.0294 21-Feb-2020 18:43 13K [   ] 8.2.0295 21-Feb-2020 21:31 17K [TXT] 8.2.0296 22-Feb-2020 14:27 19K [TXT] 8.2.0297 22-Feb-2020 15:02 2.1K [   ] 8.2.0298 22-Feb-2020 18:37 5.5K [   ] 8.2.0299 22-Feb-2020 19:16 5.8K [   ] 8.2.0300 22-Feb-2020 20:34 1.7K [TXT] 8.2.0301 22-Feb-2020 21:22 8.0K [TXT] 8.2.0302 22-Feb-2020 22:46 3.0K [TXT] 8.2.0303 22-Feb-2020 23:09 1.4K [TXT] 8.2.0304 23-Feb-2020 13:30 1.8K [TXT] 8.2.0305 23-Feb-2020 13:38 3.3K [   ] 8.2.0306 23-Feb-2020 14:36 2.8K [   ] 8.2.0307 23-Feb-2020 15:11 2.9K [   ] 8.2.0308 23-Feb-2020 15:18 2.5K [   ] 8.2.0309 23-Feb-2020 15:30 5.8K [TXT] 8.2.0310 23-Feb-2020 16:17 2.8K [TXT] 8.2.0311 23-Feb-2020 18:44 2.5K [   ] 8.2.0312 23-Feb-2020 21:28 12K [   ] 8.2.0313 24-Feb-2020 21:39 5.4K [TXT] 8.2.0314 24-Feb-2020 21:39 1.8K [TXT] 8.2.0315 25-Feb-2020 21:34 2.9K [   ] 8.2.0316 25-Feb-2020 21:48 8.9K [TXT] 8.2.0317 25-Feb-2020 22:05 1.8K [   ] 8.2.0318 25-Feb-2020 22:59 4.4K [   ] 8.2.0319 26-Feb-2020 16:18 3.5K [   ] 8.2.0320 26-Feb-2020 16:18 217K [   ] 8.2.0321 26-Feb-2020 18:25 8.4K [   ] 8.2.0322 26-Feb-2020 20:16 5.6K [TXT] 8.2.0323 26-Feb-2020 21:25 8.3K [TXT] 8.2.0324 26-Feb-2020 22:06 8.6K [TXT] 8.2.0325 27-Feb-2020 21:33 11K [   ] 8.2.0326 27-Feb-2020 21:49 1.7K [TXT] 8.2.0327 28-Feb-2020 19:12 2.9K [TXT] 8.2.0328 28-Feb-2020 22:21 15K [TXT] 8.2.0329 28-Feb-2020 22:45 3.6K [TXT] 8.2.0330 28-Feb-2020 22:52 1.3K [   ] 8.2.0331 29-Feb-2020 13:44 3.1K [   ] 8.2.0332 29-Feb-2020 14:46 4.4K [TXT] 8.2.0333 29-Feb-2020 16:10 3.9K [TXT] 8.2.0334 29-Feb-2020 17:38 6.0K [TXT] 8.2.0335 29-Feb-2020 22:07 4.1K [   ] 8.2.0336 29-Feb-2020 23:25 12K [   ] 8.2.0337 01-Mar-2020 01:06 1.5K [TXT] 8.2.0338 01-Mar-2020 13:02 1.4K [TXT] 8.2.0339 01-Mar-2020 14:05 73K [TXT] 8.2.0340 01-Mar-2020 15:37 5.0K [TXT] 8.2.0341 01-Mar-2020 16:23 3.1K [   ] 8.2.0342 01-Mar-2020 16:53 5.6K [   ] 8.2.0343 01-Mar-2020 17:56 4.7K [TXT] 8.2.0344 01-Mar-2020 20:04 1.4K [TXT] 8.2.0345 01-Mar-2020 20:35 1.5K [   ] 8.2.0346 01-Mar-2020 23:33 7.7K [   ] 8.2.0347 02-Mar-2020 20:55 10K [   ] 8.2.0348 02-Mar-2020 22:54 11K [   ] 8.2.0349 03-Mar-2020 19:02 3.0K [TXT] 8.2.0350 03-Mar-2020 21:54 22K [TXT] 8.2.0351 03-Mar-2020 22:57 1.5K [TXT] 8.2.0352 03-Mar-2020 23:07 4.1K [TXT] 8.2.0353 04-Mar-2020 21:51 2.6K [TXT] 8.2.0354 04-Mar-2020 22:06 1.4K [   ] 8.2.0355 04-Mar-2020 23:22 4.3K [   ] 8.2.0356 04-Mar-2020 23:22 6.6K [TXT] 8.2.0357 05-Mar-2020 21:53 3.9K [   ] 8.2.0358 06-Mar-2020 20:36 8.8K [TXT] 8.2.0359 06-Mar-2020 21:44 2.2K [TXT] 8.2.0360 06-Mar-2020 22:28 1.9K [   ] 8.2.0361 07-Mar-2020 17:00 3.1K [   ] 8.2.0362 07-Mar-2020 17:26 2.1K [   ] 8.2.0363 08-Mar-2020 05:15 22K [   ] 8.2.0364 08-Mar-2020 18:44 2.5K [   ] 8.2.0365 09-Mar-2020 08:20 4.7K [   ] 8.2.0366 09-Mar-2020 12:15 7.2K [TXT] 8.2.0367 09-Mar-2020 16:44 2.1K [   ] 8.2.0368 09-Mar-2020 19:27 7.3K [   ] 8.2.0369 10-Mar-2020 07:50 34K [TXT] 8.2.0370 11-Mar-2020 13:03 2.4K [TXT] 8.2.0371 11-Mar-2020 14:21 6.6K [TXT] 8.2.0372 11-Mar-2020 19:17 4.4K [   ] 8.2.0373 11-Mar-2020 19:31 2.5K [   ] 8.2.0374 12-Mar-2020 19:17 1.5K [TXT] 8.2.0375 13-Mar-2020 14:38 3.3K [TXT] 8.2.0376 13-Mar-2020 14:56 1.4K [   ] 8.2.0377 13-Mar-2020 15:09 2.9K [TXT] 8.2.0378 13-Mar-2020 21:38 2.6K [TXT] 8.2.0379 14-Mar-2020 07:47 1.8K [   ] 8.2.0380 14-Mar-2020 15:28 5.6K [TXT] 8.2.0381 14-Mar-2020 17:23 2.7K [   ] 8.2.0382 15-Mar-2020 14:20 11K [   ] 8.2.0383 15-Mar-2020 14:55 1.6K [TXT] 8.2.0384 15-Mar-2020 15:10 3.6K [   ] 8.2.0385 15-Mar-2020 16:14 38K [   ] 8.2.0386 15-Mar-2020 16:53 1.7K [TXT] 8.2.0387 15-Mar-2020 18:16 2.3K [   ] 8.2.0388 15-Mar-2020 18:28 6.5K [   ] 8.2.0389 15-Mar-2020 19:18 1.6K [   ] 8.2.0390 15-Mar-2020 20:35 6.6K [TXT] 8.2.0391 16-Mar-2020 12:10 2.6K [TXT] 8.2.0392 16-Mar-2020 20:05 3.0K [   ] 8.2.0393 16-Mar-2020 20:08 2.2K [   ] 8.2.0394 16-Mar-2020 21:09 1.6K [   ] 8.2.0395 16-Mar-2020 21:09 1.8K [   ] 8.2.0396 16-Mar-2020 21:26 13K [TXT] 8.2.0397 16-Mar-2020 22:09 2.4K [   ] 8.2.0398 17-Mar-2020 20:58 4.9K [TXT] 8.2.0399 18-Mar-2020 15:24 4.7K [TXT] 8.2.0400 18-Mar-2020 19:19 4.1K [TXT] 8.2.0401 18-Mar-2020 19:33 17K [   ] 8.2.0402 18-Mar-2020 21:11 3.4K [TXT] 8.2.0403 19-Mar-2020 12:39 2.8K [   ] 8.2.0404 19-Mar-2020 13:09 2.0K [   ] 8.2.0405 19-Mar-2020 13:37 3.0K [   ] 8.2.0406 19-Mar-2020 13:55 2.2K [   ] 8.2.0407 19-Mar-2020 14:38 3.9K [TXT] 8.2.0408 19-Mar-2020 14:53 1.3K [TXT] 8.2.0409 19-Mar-2020 15:06 13K [   ] 8.2.0410 19-Mar-2020 16:23 2.0K [TXT] 8.2.0411 19-Mar-2020 16:29 1.8K [TXT] 8.2.0412 19-Mar-2020 17:14 2.8K [TXT] 8.2.0413 19-Mar-2020 18:52 21K [TXT] 8.2.0414 19-Mar-2020 19:45 5.4K [TXT] 8.2.0415 19-Mar-2020 20:32 3.1K [TXT] 8.2.0416 19-Mar-2020 20:34 1.6K [   ] 8.2.0417 20-Mar-2020 18:12 8.5K [   ] 8.2.0418 20-Mar-2020 18:21 20K [TXT] 8.2.0419 20-Mar-2020 18:40 18K [TXT] 8.2.0420 20-Mar-2020 19:38 3.0K [   ] 8.2.0421 20-Mar-2020 20:49 3.9K [   ] 8.2.0422 20-Mar-2020 21:16 2.5K [TXT] 8.2.0423 21-Mar-2020 15:20 5.4K [TXT] 8.2.0424 22-Mar-2020 13:45 2.4K [   ] 8.2.0425 22-Mar-2020 14:10 50K [   ] 8.2.0426 22-Mar-2020 14:42 5.5K [TXT] 8.2.0427 22-Mar-2020 16:18 37K [TXT] 8.2.0428 22-Mar-2020 19:26 2.8K [TXT] 8.2.0429 22-Mar-2020 20:14 1.5K [TXT] 8.2.0430 22-Mar-2020 21:24 5.1K [TXT] 8.2.0431 23-Mar-2020 19:18 1.9K [TXT] 8.2.0432 23-Mar-2020 19:29 6.0K [   ] 8.2.0433 23-Mar-2020 20:55 5.0K [TXT] 8.2.0434 23-Mar-2020 21:46 1.4K [   ] 8.2.0435 23-Mar-2020 22:02 2.0K [TXT] 8.2.0436 23-Mar-2020 22:13 13K [TXT] 8.2.0437 23-Mar-2020 22:17 6.5K [TXT] 8.2.0438 23-Mar-2020 22:47 2.6K [TXT] 8.2.0439 24-Mar-2020 10:24 5.0K [TXT] 8.2.0440 24-Mar-2020 10:33 3.3K [TXT] 8.2.0441 24-Mar-2020 12:13 2.8K [TXT] 8.2.0442 24-Mar-2020 20:36 2.7K [   ] 8.2.0443 24-Mar-2020 21:43 135K [TXT] 8.2.0444 24-Mar-2020 21:45 3.2K [   ] 8.2.0445 25-Mar-2020 20:17 2.3K [   ] 8.2.0446 25-Mar-2020 21:14 2.4K [TXT] 8.2.0447 25-Mar-2020 21:28 2.3K [   ] 8.2.0448 25-Mar-2020 22:24 24K [   ] 8.2.0449 26-Mar-2020 13:16 2.9K [   ] 8.2.0450 26-Mar-2020 14:12 11K [TXT] 8.2.0451 26-Mar-2020 15:40 1.6K [   ] 8.2.0452 26-Mar-2020 16:05 2.2K [   ] 8.2.0453 26-Mar-2020 16:28 3.2K [TXT] 8.2.0454 26-Mar-2020 16:51 6.3K [TXT] 8.2.0455 26-Mar-2020 20:34 19K [   ] 8.2.0456 26-Mar-2020 20:52 2.6K [TXT] 8.2.0457 26-Mar-2020 21:12 2.4K [TXT] 8.2.0458 26-Mar-2020 22:10 1.6K [   ] 8.2.0459 26-Mar-2020 22:17 47K [   ] 8.2.0460 26-Mar-2020 23:14 2.6K [   ] 8.2.0461 27-Mar-2020 19:41 1.5K [TXT] 8.2.0462 27-Mar-2020 20:25 3.3K [TXT] 8.2.0463 27-Mar-2020 20:53 2.5K [TXT] 8.2.0464 27-Mar-2020 21:00 5.5K [   ] 8.2.0465 28-Mar-2020 14:54 5.7K [TXT] 8.2.0466 28-Mar-2020 18:08 4.4K [   ] 8.2.0467 28-Mar-2020 19:42 8.0K [TXT] 8.2.0468 28-Mar-2020 20:45 7.0K [TXT] 8.2.0469 28-Mar-2020 21:38 4.3K [   ] 8.2.0470 28-Mar-2020 21:49 1.9K [TXT] 8.2.0471 28-Mar-2020 22:07 1.7K [TXT] 8.2.0472 28-Mar-2020 22:37 1.4K [TXT] 8.2.0473 29-Mar-2020 15:12 3.5K [   ] 8.2.0474 29-Mar-2020 16:07 3.3K [   ] 8.2.0475 29-Mar-2020 16:19 2.1K [   ] 8.2.0476 29-Mar-2020 17:52 2.3K [   ] 8.2.0477 29-Mar-2020 18:41 3.2K [TXT] 8.2.0478 29-Mar-2020 20:09 4.5K [   ] 8.2.0479 29-Mar-2020 20:52 4.5K [   ] 8.2.0480 29-Mar-2020 21:39 3.4K [   ] 8.2.0481 30-Mar-2020 19:14 6.9K [   ] 8.2.0482 30-Mar-2020 19:41 31K [TXT] 8.2.0483 30-Mar-2020 21:06 2.6K [   ] 8.2.0484 30-Mar-2020 21:23 2.8K [   ] 8.2.0485 30-Mar-2020 21:29 2.4K [   ] 8.2.0486 30-Mar-2020 22:52 7.8K [TXT] 8.2.0487 31-Mar-2020 23:14 9.3K [TXT] 8.2.0488 31-Mar-2020 23:33 5.2K [TXT] 8.2.0489 01-Apr-2020 16:35 6.1K [   ] 8.2.0490 01-Apr-2020 18:30 1.7K [TXT] 8.2.0491 01-Apr-2020 19:23 4.7K [TXT] 8.2.0492 01-Apr-2020 21:19 8.7K [TXT] 8.2.0493 01-Apr-2020 22:11 10K [TXT] 8.2.0494 01-Apr-2020 22:37 1.6K [TXT] 8.2.0495 01-Apr-2020 23:06 4.7K [   ] 8.2.0496 02-Apr-2020 13:51 3.3K [TXT] 8.2.0497 02-Apr-2020 15:18 2.5K [TXT] 8.2.0498 02-Apr-2020 16:01 1.7K [TXT] 8.2.0499 02-Apr-2020 18:35 9.0K [TXT] 8.2.0500 02-Apr-2020 18:52 65K [   ] 8.2.0501 02-Apr-2020 19:12 1.9K [   ] 8.2.0502 02-Apr-2020 21:14 19K [TXT] 8.2.0503 02-Apr-2020 22:34 7.8K [TXT] 8.2.0504 02-Apr-2020 22:58 2.3K [   ] 8.2.0505 03-Apr-2020 12:57 3.6K [TXT] 8.2.0506 03-Apr-2020 18:14 1.6K [TXT] 8.2.0507 03-Apr-2020 18:44 2.7K [   ] 8.2.0508 03-Apr-2020 22:00 30K [   ] 8.2.0509 04-Apr-2020 14:01 24K [   ] 8.2.0510 04-Apr-2020 14:51 2.4K [   ] 8.2.0511 05-Apr-2020 15:37 16K [TXT] 8.2.0512 05-Apr-2020 17:09 58K [TXT] 8.2.0513 05-Apr-2020 21:39 2.9K [TXT] 8.2.0514 05-Apr-2020 18:57 7.7K [   ] 8.2.0515 05-Apr-2020 19:09 3.2K [   ] 8.2.0516 05-Apr-2020 20:21 61K [   ] 8.2.0517 05-Apr-2020 21:39 20K [   ] 8.2.0518 05-Apr-2020 21:42 2.1K [TXT] 8.2.0519 05-Apr-2020 22:16 3.5K [   ] 8.2.0520 05-Apr-2020 23:05 1.6K [TXT] 8.2.0521 06-Apr-2020 21:13 3.3K [   ] 8.2.0522 06-Apr-2020 21:35 19K [   ] 8.2.0523 06-Apr-2020 22:13 24K [TXT] 8.2.0524 06-Apr-2020 22:57 4.1K [TXT] 8.2.0525 06-Apr-2020 23:50 2.2K [   ] 8.2.0526 09-Apr-2020 12:55 1.9K [   ] 8.2.0527 07-Apr-2020 20:54 11K [TXT] 8.2.0528 07-Apr-2020 22:05 4.8K [   ] 8.2.0529 07-Apr-2020 22:45 4.0K [TXT] 8.2.0530 08-Apr-2020 11:32 2.1K [   ] 8.2.0531 08-Apr-2020 19:49 18K [TXT] 8.2.0532 08-Apr-2020 20:04 3.7K [TXT] 8.2.0533 08-Apr-2020 21:51 79K [   ] 8.2.0534 08-Apr-2020 22:57 1.9K [   ] 8.2.0535 09-Apr-2020 18:43 16K [TXT] 8.2.0536 09-Apr-2020 20:11 7.0K [   ] 8.2.0537 09-Apr-2020 20:11 2.8K [   ] 8.2.0538 09-Apr-2020 21:08 6.3K [TXT] 8.2.0539 09-Apr-2020 21:34 2.6K [   ] 8.2.0540 11-Apr-2020 17:10 27K [   ] 8.2.0541 11-Apr-2020 18:03 12K [   ] 8.2.0542 11-Apr-2020 18:37 2.8K [TXT] 8.2.0543 11-Apr-2020 20:51 22K [TXT] 8.2.0544 11-Apr-2020 21:36 1.6K [TXT] 8.2.0545 11-Apr-2020 21:45 8.7K [TXT] 8.2.0546 11-Apr-2020 22:32 8.0K [TXT] 8.2.0547 11-Apr-2020 22:39 3.4K [   ] 8.2.0548 11-Apr-2020 23:19 5.9K [   ] 8.2.0549 12-Apr-2020 12:55 3.9K [TXT] 8.2.0550 12-Apr-2020 13:39 3.6K [   ] 8.2.0551 12-Apr-2020 13:51 8.9K [   ] 8.2.0552 12-Apr-2020 14:40 4.5K [TXT] 8.2.0553 12-Apr-2020 14:51 1.8K [TXT] 8.2.0554 12-Apr-2020 15:11 2.8K [TXT] 8.2.0555 12-Apr-2020 16:40 7.5K [   ] 8.2.0556 12-Apr-2020 17:12 1.9K [   ] 8.2.0557 12-Apr-2020 17:54 56K [   ] 8.2.0558 12-Apr-2020 18:02 2.3K [TXT] 8.2.0559 12-Apr-2020 19:38 78K [TXT] 8.2.0560 12-Apr-2020 20:03 2.7K [TXT] 8.2.0561 12-Apr-2020 20:20 7.1K [TXT] 8.2.0562 12-Apr-2020 20:56 17K [TXT] 8.2.0563 12-Apr-2020 21:53 8.2K [   ] 8.2.0564 12-Apr-2020 22:23 3.5K [   ] 8.2.0565 12-Apr-2020 22:54 48K [   ] 8.2.0566 12-Apr-2020 23:10 2.2K [TXT] 8.2.0567 13-Apr-2020 14:42 15K [TXT] 8.2.0568 13-Apr-2020 15:00 4.2K [TXT] 8.2.0569 13-Apr-2020 15:07 1.4K [TXT] 8.2.0570 13-Apr-2020 17:21 6.8K [TXT] 8.2.0571 13-Apr-2020 17:45 2.1K [   ] 8.2.0572 13-Apr-2020 18:14 1.4K [   ] 8.2.0573 13-Apr-2020 18:26 3.9K [   ] 8.2.0574 13-Apr-2020 19:05 2.4K [   ] 8.2.0575 13-Apr-2020 19:47 2.1K [   ] 8.2.0576 13-Apr-2020 19:56 3.1K [TXT] 8.2.0577 13-Apr-2020 21:17 11K [TXT] 8.2.0578 14-Apr-2020 20:16 166K [   ] 8.2.0579 14-Apr-2020 20:57 1.9K [TXT] 8.2.0580 15-Apr-2020 20:06 3.3K [TXT] 8.2.0581 15-Apr-2020 21:06 3.3K [   ] 8.2.0582 15-Apr-2020 21:45 3.8K [TXT] 8.2.0583 16-Apr-2020 13:01 5.5K [TXT] 8.2.0584 16-Apr-2020 21:05 1.8K [TXT] 8.2.0585 16-Apr-2020 22:11 9.1K [   ] 8.2.0586 16-Apr-2020 23:00 2.9K [TXT] 8.2.0587 16-Apr-2020 23:02 1.5K [TXT] 8.2.0588 17-Apr-2020 16:41 2.8K [   ] 8.2.0589 17-Apr-2020 19:23 2.6K [TXT] 8.2.0590 17-Apr-2020 19:42 10K [   ] 8.2.0591 17-Apr-2020 20:49 2.0K [TXT] 8.2.0592 17-Apr-2020 21:14 1.4K [TXT] 8.2.0593 18-Apr-2020 17:46 3.4K [   ] 8.2.0594 18-Apr-2020 19:09 5.4K [   ] 8.2.0595 18-Apr-2020 19:54 14K [TXT] 8.2.0596 18-Apr-2020 20:52 2.5K [   ] 8.2.0597 18-Apr-2020 21:57 12K [TXT] 8.2.0598 18-Apr-2020 23:21 2.0K [TXT] 8.2.0599 19-Apr-2020 14:03 39K [   ] 8.2.0600 19-Apr-2020 16:29 15K [TXT] 8.2.0601 19-Apr-2020 16:29 18K [TXT] 8.2.0602 19-Apr-2020 17:25 5.2K [   ] 8.2.0603 19-Apr-2020 17:47 3.4K [TXT] 8.2.0604 19-Apr-2020 18:13 2.5K [   ] 8.2.0605 19-Apr-2020 18:28 5.4K [   ] 8.2.0606 19-Apr-2020 18:32 6.4K [TXT] 8.2.0607 19-Apr-2020 22:59 3.2K [TXT] 8.2.0608 20-Apr-2020 16:12 1.8K [TXT] 8.2.0609 20-Apr-2020 16:22 2.6K [   ] 8.2.0610 20-Apr-2020 16:50 20K [   ] 8.2.0611 20-Apr-2020 18:43 4.8K [TXT] 8.2.0612 20-Apr-2020 19:42 11K [TXT] 8.2.0613 20-Apr-2020 22:43 19K [TXT] 8.2.0614 21-Apr-2020 22:02 13K [   ] 8.2.0615 21-Apr-2020 22:20 20K [TXT] 8.2.0616 21-Apr-2020 22:45 1.6K [   ] 8.2.0617 22-Apr-2020 17:37 2.5K [   ] 8.2.0618 22-Apr-2020 19:15 2.4K [TXT] 8.2.0619 23-Apr-2020 13:39 14K [   ] 8.2.0620 23-Apr-2020 13:58 5.6K [   ] 8.2.0621 23-Apr-2020 14:42 2.5K [TXT] 8.2.0622 23-Apr-2020 15:43 12K [   ] 8.2.0623 23-Apr-2020 15:47 1.5K [TXT] 8.2.0624 23-Apr-2020 17:08 8.4K [TXT] 8.2.0625 23-Apr-2020 18:14 4.6K [TXT] 8.2.0626 23-Apr-2020 22:17 14K [TXT] 8.2.0627 23-Apr-2020 22:24 1.4K [   ] 8.2.0628 23-Apr-2020 23:55 79K [TXT] 8.2.0629 24-Apr-2020 20:58 2.9K [TXT] 8.2.0630 24-Apr-2020 21:22 1.2K [   ] 8.2.0631 24-Apr-2020 22:17 250K [TXT] 8.2.0632 24-Apr-2020 22:20 1.4K [   ] 8.2.0633 24-Apr-2020 22:48 13K [   ] 8.2.0634 25-Apr-2020 15:25 19K [   ] 8.2.0635 25-Apr-2020 15:36 1.6K [TXT] 8.2.0636 25-Apr-2020 15:46 1.5K [TXT] 8.2.0637 25-Apr-2020 15:54 3.2K [TXT] 8.2.0638 25-Apr-2020 16:42 1.5K [TXT] 8.2.0639 25-Apr-2020 17:14 3.4K [   ] 8.2.0640 25-Apr-2020 20:03 41K [TXT] 8.2.0641 26-Apr-2020 13:51 5.0K [   ] 8.2.0642 26-Apr-2020 14:30 2.4K [TXT] 8.2.0643 26-Apr-2020 15:35 2.9K [   ] 8.2.0644 26-Apr-2020 16:00 17K [   ] 8.2.0645 26-Apr-2020 16:06 1.8K [TXT] 8.2.0646 26-Apr-2020 16:53 3.0K [TXT] 8.2.0647 26-Apr-2020 19:01 2.1K [TXT] 8.2.0648 27-Apr-2020 19:29 2.8K [   ] 8.2.0649 27-Apr-2020 20:19 2.8K [   ] 8.2.0650 27-Apr-2020 22:48 35K [TXT] 8.2.0651 27-Apr-2020 23:18 1.5K [TXT] 8.2.0652 27-Apr-2020 23:18 2.1K [   ] 8.2.0653 27-Apr-2020 23:40 4.7K [   ] 8.2.0654 28-Apr-2020 00:03 1.5K [   ] 8.2.0655 28-Apr-2020 20:29 26K [TXT] 8.2.0656 28-Apr-2020 20:45 3.3K [TXT] 8.2.0657 28-Apr-2020 21:30 6.0K [   ] 8.2.0658 28-Apr-2020 21:59 1.7K [   ] 8.2.0659 28-Apr-2020 22:50 3.9K [TXT] 8.2.0660 29-Apr-2020 21:05 115K [TXT] 8.2.0661 29-Apr-2020 22:02 24K [   ] 8.2.0662 29-Apr-2020 22:31 4.7K [   ] 8.2.0663 29-Apr-2020 23:04 3.8K [TXT] 8.2.0664 29-Apr-2020 23:17 8.5K [TXT] 8.2.0665 30-Apr-2020 19:10 5.9K [TXT] 8.2.0666 30-Apr-2020 19:20 3.2K [   ] 8.2.0667 30-Apr-2020 19:55 26K [   ] 8.2.0668 30-Apr-2020 20:22 1.5K [TXT] 8.2.0669 30-Apr-2020 21:00 16K [   ] 8.2.0670 30-Apr-2020 22:32 20K [TXT] 8.2.0671 30-Apr-2020 22:51 3.3K [   ] 8.2.0672 01-May-2020 14:11 5.4K [   ] 8.2.0673 01-May-2020 14:14 1.7K [   ] 8.2.0674 01-May-2020 14:27 78K [TXT] 8.2.0675 01-May-2020 15:45 22K [   ] 8.2.0676 01-May-2020 16:08 1.6K [TXT] 8.2.0677 01-May-2020 19:29 23K [   ] 8.2.0678 02-May-2020 14:53 1.7K [TXT] 8.2.0679 02-May-2020 17:53 27K [TXT] 8.2.0680 02-May-2020 18:15 6.7K [TXT] 8.2.0681 02-May-2020 18:34 1.5K [   ] 8.2.0682 02-May-2020 19:05 1.8K [   ] 8.2.0683 02-May-2020 23:13 6.2K [TXT] 8.2.0684 03-May-2020 15:39 12K [TXT] 8.2.0685 03-May-2020 15:54 2.0K [   ] 8.2.0686 03-May-2020 16:05 7.4K [TXT] 8.2.0687 03-May-2020 16:30 5.1K [   ] 8.2.0688 03-May-2020 17:02 2.7K [TXT] 8.2.0689 03-May-2020 17:04 2.2K [TXT] 8.2.0690 03-May-2020 17:20 3.3K [   ] 8.2.0691 03-May-2020 17:56 2.0K [   ] 8.2.0692 03-May-2020 18:21 2.0K [TXT] 8.2.0693 03-May-2020 22:31 6.0K [TXT] 8.2.0694 03-May-2020 22:58 7.7K [TXT] 8.2.0695 04-May-2020 23:25 16K [TXT] 8.2.0696 05-May-2020 18:06 5.8K [   ] 8.2.0697 05-May-2020 19:47 3.0K [   ] 8.2.0698 05-May-2020 19:58 7.7K [TXT] 8.2.0699 05-May-2020 22:09 9.0K [   ] 8.2.0700 05-May-2020 22:09 2.6K [   ] 8.2.0701 05-May-2020 23:33 2.0K [   ] 8.2.0702 06-May-2020 19:38 1.5K [   ] 8.2.0703 06-May-2020 21:07 9.0K [   ] 8.2.0704 06-May-2020 22:19 2.7K [TXT] 8.2.0705 06-May-2020 22:37 1.8K [   ] 8.2.0706 07-May-2020 14:08 3.1K [   ] 8.2.0707 07-May-2020 14:38 1.6K [TXT] 8.2.0708 07-May-2020 16:59 24K [   ] 8.2.0709 07-May-2020 17:49 1.5K [TXT] 8.2.0710 07-May-2020 18:17 1.5K [TXT] 8.2.0711 07-May-2020 18:37 6.5K [   ] 8.2.0712 07-May-2020 18:44 5.1K [TXT] 8.2.0713 07-May-2020 22:20 2.1K [TXT] 8.2.0714 07-May-2020 22:20 13K [TXT] 8.2.0715 07-May-2020 22:24 1.4K [TXT] 8.2.0716 07-May-2020 23:21 2.7K [TXT] 8.2.0717 08-May-2020 19:11 20K [TXT] 8.2.0718 09-May-2020 13:07 1.6K [TXT] 8.2.0719 09-May-2020 15:45 45K [   ] 8.2.0720 09-May-2020 16:12 2.1K [   ] 8.2.0721 09-May-2020 16:45 1.7K [TXT] 8.2.0722 09-May-2020 17:40 13K [TXT] 8.2.0723 09-May-2020 18:30 5.1K [   ] 8.2.0724 09-May-2020 18:45 1.9K [TXT] 8.2.0725 09-May-2020 22:51 19K [TXT] 8.2.0726 09-May-2020 23:21 2.3K [TXT] 8.2.0727 10-May-2020 13:43 1.9K [TXT] 8.2.0728 10-May-2020 14:14 2.9K [TXT] 8.2.0729 10-May-2020 15:25 5.9K [   ] 8.2.0730 10-May-2020 19:11 32K [TXT] 8.2.0731 10-May-2020 21:21 2.2K [   ] 8.2.0732 10-May-2020 21:48 2.2K [TXT] 8.2.0733 10-May-2020 22:54 5.5K [TXT] 8.2.0734 10-May-2020 23:12 1.7K [TXT] 8.2.0735 10-May-2020 23:20 2.0K [   ] 8.2.0736 11-May-2020 19:47 2.7K [TXT] 8.2.0737 11-May-2020 20:56 3.6K [TXT] 8.2.0738 11-May-2020 22:14 22K [TXT] 8.2.0739 11-May-2020 23:21 4.7K [   ] 8.2.0740 11-May-2020 23:21 12K [TXT] 8.2.0741 12-May-2020 13:08 50K [TXT] 8.2.0742 12-May-2020 14:42 2.8K [   ] 8.2.0743 12-May-2020 22:03 2.6K [TXT] 8.2.0744 12-May-2020 23:46 1.9K [   ] 8.2.0745 12-May-2020 23:46 2.4K [TXT] 8.2.0746 13-May-2020 01:05 4.6K [TXT] 8.2.0747 13-May-2020 13:40 14K [TXT] 8.2.0748 13-May-2020 16:34 7.6K [TXT] 8.2.0749 13-May-2020 17:16 1.7K [   ] 8.2.0750 13-May-2020 17:16 2.5K [   ] 8.2.0751 13-May-2020 23:32 26K [   ] 8.2.0752 13-May-2020 23:32 2.1K [TXT] 8.2.0753 14-May-2020 22:42 44K [   ] 8.2.0754 14-May-2020 23:21 1.9K [TXT] 8.2.0755 15-May-2020 18:18 5.2K [TXT] 8.2.0756 15-May-2020 18:22 1.8K [   ] 8.2.0757 15-May-2020 19:22 11K [   ] 8.2.0758 15-May-2020 21:43 22K [TXT] 8.2.0759 15-May-2020 21:43 10K [   ] 8.2.0760 15-May-2020 21:45 2.7K [   ] 8.2.0761 15-May-2020 22:02 5.7K [TXT] 8.2.0762 15-May-2020 22:31 2.3K [TXT] 8.2.0763 15-May-2020 22:47 1.5K [   ] 8.2.0764 15-May-2020 23:41 3.9K [TXT] 8.2.0765 16-May-2020 14:02 12K [TXT] 8.2.0766 16-May-2020 14:08 3.2K [   ] 8.2.0767 16-May-2020 15:05 1.7K [   ] 8.2.0768 16-May-2020 15:44 1.8K [TXT] 8.2.0769 16-May-2020 16:22 3.2K [TXT] 8.2.0770 16-May-2020 18:58 3.0K [   ] 8.2.0771 16-May-2020 22:36 7.9K [   ] 8.2.0772 16-May-2020 22:36 2.5K [TXT] 8.2.0773 16-May-2020 23:15 5.4K [TXT] 8.2.0774 17-May-2020 14:07 12K [TXT] 8.2.0775 17-May-2020 14:34 12K [TXT] 8.2.0776 17-May-2020 15:00 6.8K [   ] 8.2.0777 17-May-2020 15:10 2.1K [TXT] 8.2.0778 17-May-2020 16:10 8.1K [TXT] 8.2.0779 17-May-2020 16:10 2.1K [TXT] 8.2.0780 17-May-2020 16:30 44K [   ] 8.2.0781 17-May-2020 16:57 1.5K [TXT] 8.2.0782 17-May-2020 18:54 2.2K [TXT] 8.2.0783 17-May-2020 20:53 11K [TXT] 8.2.0784 17-May-2020 21:52 10K [TXT] 8.2.0785 17-May-2020 22:34 9.1K [TXT] 8.2.0786 17-May-2020 22:34 2.3K [TXT] 8.2.0787 17-May-2020 23:02 17K [   ] 8.2.0788 17-May-2020 23:35 1.7K [   ] 8.2.0789 18-May-2020 13:38 3.8K [   ] 8.2.0790 18-May-2020 14:21 3.7K [TXT] 8.2.0791 18-May-2020 19:47 11K [TXT] 8.2.0792 18-May-2020 20:12 1.3K [TXT] 8.2.0793 18-May-2020 20:18 2.1K [TXT] 8.2.0794 18-May-2020 21:13 15K [TXT] 8.2.0795 18-May-2020 21:51 23K [   ] 8.2.0796 18-May-2020 23:28 1.6K [   ] 8.2.0797 19-May-2020 10:33 1.5K [TXT] 8.2.0798 19-May-2020 21:30 49K [   ] 8.2.0799 19-May-2020 21:44 2.7K [TXT] 8.2.0800 19-May-2020 23:11 8.0K [   ] 8.2.0801 19-May-2020 23:11 3.4K [TXT] 8.2.0802 20-May-2020 18:42 17K [TXT] 8.2.0803 20-May-2020 19:31 11K [TXT] 8.2.0804 21-May-2020 20:14 45K [   ] 8.2.0805 21-May-2020 20:40 4.0K [TXT] 8.2.0806 21-May-2020 21:51 2.5K [   ] 8.2.0807 22-May-2020 13:11 18K [TXT] 8.2.0808 22-May-2020 13:34 10K [   ] 8.2.0809 22-May-2020 13:41 3.1K [   ] 8.2.0810 22-May-2020 14:46 2.3K [   ] 8.2.0811 22-May-2020 14:46 3.2K [   ] 8.2.0812 22-May-2020 20:09 4.7K [   ] 8.2.0813 22-May-2020 22:07 52K [   ] 8.2.0814 23-May-2020 19:30 1.7K [   ] 8.2.0815 24-May-2020 13:11 14K [TXT] 8.2.0816 24-May-2020 17:24 6.9K [TXT] 8.2.0817 24-May-2020 18:46 3.2K [TXT] 8.2.0818 24-May-2020 23:15 58K [TXT] 8.2.0819 24-May-2020 23:15 1.3K [TXT] 8.2.0820 24-May-2020 23:46 9.3K [TXT] 8.2.0821 25-May-2020 00:29 2.3K [TXT] 8.2.0822 25-May-2020 20:42 8.1K [TXT] 8.2.0823 25-May-2020 22:37 18K [TXT] 8.2.0824 25-May-2020 23:02 2.4K [   ] 8.2.0825 26-May-2020 11:10 1.7K [TXT] 8.2.0826 26-May-2020 11:10 2.1K [TXT] 8.2.0827 26-May-2020 20:09 1.3K [TXT] 8.2.0828 26-May-2020 20:09 4.9K [   ] 8.2.0829 26-May-2020 20:22 2.5K [TXT] 8.2.0830 26-May-2020 22:16 1.5K [   ] 8.2.0831 27-May-2020 21:23 2.5K [   ] 8.2.0832 27-May-2020 21:30 1.6K [TXT] 8.2.0833 27-May-2020 22:09 1.4K [TXT] 8.2.0834 27-May-2020 23:19 2.1K [TXT] 8.2.0835 28-May-2020 21:04 2.6K [TXT] 8.2.0836 29-May-2020 21:41 4.7K [TXT] 8.2.0837 29-May-2020 21:48 1.9K [   ] 8.2.0838 29-May-2020 21:43 1.6K [TXT] 8.2.0839 29-May-2020 22:42 8.2K [TXT] 8.2.0840 29-May-2020 22:50 3.5K [TXT] 8.2.0841 29-May-2020 23:04 2.8K [TXT] 8.2.0842 30-May-2020 13:08 1.9K [   ] 8.2.0843 30-May-2020 13:16 2.0K [   ] 8.2.0844 30-May-2020 14:47 18K [   ] 8.2.0845 30-May-2020 15:32 28K [TXT] 8.2.0846 30-May-2020 16:18 1.4K [   ] 8.2.0847 30-May-2020 17:07 89K [TXT] 8.2.0848 30-May-2020 17:50 8.0K [TXT] 8.2.0849 30-May-2020 18:16 33K [TXT] 8.2.0850 30-May-2020 18:38 13K [TXT] 8.2.0851 30-May-2020 19:53 6.3K [   ] 8.2.0852 30-May-2020 20:05 1.6K [TXT] 8.2.0853 30-May-2020 20:31 24K [TXT] 8.2.0854 30-May-2020 21:53 6.0K [TXT] 8.2.0855 30-May-2020 21:53 16K [TXT] 8.2.0856 31-May-2020 13:12 1.9K [TXT] 8.2.0857 31-May-2020 13:53 1.9K [   ] 8.2.0858 31-May-2020 14:10 8.2K [TXT] 8.2.0859 31-May-2020 14:26 55K [TXT] 8.2.0860 31-May-2020 15:09 12K [TXT] 8.2.0861 31-May-2020 15:42 8.3K [TXT] 8.2.0862 31-May-2020 16:05 3.8K [TXT] 8.2.0863 31-May-2020 16:59 23K [TXT] 8.2.0864 31-May-2020 17:50 5.0K [TXT] 8.2.0865 31-May-2020 19:49 12K [   ] 8.2.0866 31-May-2020 21:28 20K [TXT] 8.2.0867 31-May-2020 22:07 9.3K [TXT] 8.2.0868 31-May-2020 22:21 8.3K [TXT] 8.2.0869 31-May-2020 23:12 28K [TXT] 8.2.0870 01-Jun-2020 14:09 1.6K [TXT] 8.2.0871 01-Jun-2020 14:15 4.7K [TXT] 8.2.0872 01-Jun-2020 14:35 105K [   ] 8.2.0873 01-Jun-2020 15:06 2.9K [TXT] 8.2.0874 01-Jun-2020 15:06 2.2K [   ] 8.2.0875 01-Jun-2020 16:10 30K [TXT] 8.2.0876 01-Jun-2020 16:27 4.4K [TXT] 8.2.0877 01-Jun-2020 17:29 28K [TXT] 8.2.0878 01-Jun-2020 18:40 9.2K [   ] 8.2.0879 01-Jun-2020 18:56 1.5K [TXT] 8.2.0880 01-Jun-2020 19:09 1.5K [   ] 8.2.0881 01-Jun-2020 19:15 1.5K [TXT] 8.2.0882 01-Jun-2020 20:11 4.0K [TXT] 8.2.0883 01-Jun-2020 21:14 1.3K [   ] 8.2.0884 01-Jun-2020 21:33 4.0K [TXT] 8.2.0885 02-Jun-2020 20:27 1.8K [TXT] 8.2.0886 02-Jun-2020 22:07 10K [   ] 8.2.0887 02-Jun-2020 22:07 2.5K [   ] 8.2.0888 02-Jun-2020 22:20 2.8K [TXT] 8.2.0889 02-Jun-2020 22:25 6.2K [TXT] 8.2.0890 02-Jun-2020 23:19 1.8K [   ] 8.2.0891 03-Jun-2020 10:05 1.6K [   ] 8.2.0892 03-Jun-2020 18:58 2.8K [TXT] 8.2.0893 03-Jun-2020 19:56 6.1K [TXT] 8.2.0894 03-Jun-2020 20:51 8.8K [TXT] 8.2.0895 03-Jun-2020 22:17 11K [TXT] 8.2.0896 03-Jun-2020 22:59 2.9K [TXT] 8.2.0897 04-Jun-2020 15:23 24K [TXT] 8.2.0898 04-Jun-2020 16:53 4.9K [TXT] 8.2.0899 04-Jun-2020 16:53 4.6K [TXT] 8.2.0900 04-Jun-2020 17:20 2.3K [TXT] 8.2.0901 04-Jun-2020 18:22 17K [TXT] 8.2.0902 04-Jun-2020 20:57 4.2K [   ] 8.2.0903 04-Jun-2020 21:33 1.7K [   ] 8.2.0904 04-Jun-2020 22:23 2.5K [   ] 8.2.0905 04-Jun-2020 22:46 2.6K [TXT] 8.2.0906 05-Jun-2020 19:37 2.7K [   ] 8.2.0907 05-Jun-2020 20:04 2.4K [TXT] 8.2.0908 05-Jun-2020 21:07 5.2K [TXT] 8.2.0909 05-Jun-2020 23:17 9.7K [TXT] 8.2.0910 06-Jun-2020 15:15 5.7K [TXT] 8.2.0911 06-Jun-2020 15:15 4.5K [TXT] 8.2.0912 06-Jun-2020 15:24 5.9K [TXT] 8.2.0913 06-Jun-2020 16:00 3.8K [TXT] 8.2.0914 06-Jun-2020 16:19 2.9K [   ] 8.2.0915 06-Jun-2020 18:39 15K [TXT] 8.2.0916 06-Jun-2020 22:43 8.4K [TXT] 8.2.0917 07-Jun-2020 14:11 6.4K [TXT] 8.2.0918 07-Jun-2020 14:51 12K [TXT] 8.2.0919 07-Jun-2020 15:46 4.7K [TXT] 8.2.0920 07-Jun-2020 17:04 3.5K [TXT] 8.2.0921 07-Jun-2020 17:04 3.2K [   ] 8.2.0922 07-Jun-2020 17:26 2.9K [   ] 8.2.0923 07-Jun-2020 17:59 2.3K [   ] 8.2.0924 07-Jun-2020 18:17 15K [TXT] 8.2.0925 07-Jun-2020 18:45 7.6K [TXT] 8.2.0926 07-Jun-2020 19:39 4.6K [   ] 8.2.0927 07-Jun-2020 20:08 3.0K [TXT] 8.2.0928 07-Jun-2020 20:49 12K [   ] 8.2.0929 07-Jun-2020 21:32 3.9K [TXT] 8.2.0930 07-Jun-2020 21:59 4.2K [TXT] 8.2.0931 07-Jun-2020 22:24 20K [   ] 8.2.0932 08-Jun-2020 18:55 3.2K [TXT] 8.2.0933 08-Jun-2020 19:22 7.3K [TXT] 8.2.0934 08-Jun-2020 19:36 2.8K [   ] 8.2.0935 08-Jun-2020 20:51 11K [TXT] 8.2.0936 09-Jun-2020 16:00 18K [TXT] 8.2.0937 09-Jun-2020 17:31 1.7K [   ] 8.2.0938 09-Jun-2020 19:35 6.2K [TXT] 8.2.0939 09-Jun-2020 21:36 37K [TXT] 8.2.0940 09-Jun-2020 21:36 2.3K [TXT] 8.2.0941 10-Jun-2020 12:16 17K [   ] 8.2.0942 10-Jun-2020 13:13 2.9K [TXT] 8.2.0943 10-Jun-2020 14:17 12K [TXT] 8.2.0944 10-Jun-2020 14:22 1.4K [TXT] 8.2.0945 10-Jun-2020 15:34 10K [   ] 8.2.0946 10-Jun-2020 15:46 3.4K [TXT] 8.2.0947 10-Jun-2020 15:57 3.6K [TXT] 8.2.0948 10-Jun-2020 16:40 3.1K [TXT] 8.2.0949 10-Jun-2020 16:56 1.9K [TXT] 8.2.0950 10-Jun-2020 17:14 1.5K [   ] 8.2.0951 10-Jun-2020 20:22 1.5K [TXT] 8.2.0952 10-Jun-2020 20:57 8.2K [TXT] 8.2.0953 10-Jun-2020 21:47 7.7K [TXT] 8.2.0954 10-Jun-2020 22:09 2.6K [TXT] 8.2.0955 10-Jun-2020 22:12 1.5K [TXT] 8.2.0956 10-Jun-2020 22:18 2.7K [TXT] 8.2.0957 11-Jun-2020 12:31 1.5K [TXT] 8.2.0958 11-Jun-2020 19:23 3.9K [TXT] 8.2.0959 11-Jun-2020 19:36 12K [TXT] 8.2.0960 11-Jun-2020 23:14 7.2K [TXT] 8.2.0961 12-Jun-2020 19:36 11K [   ] 8.2.0962 12-Jun-2020 20:12 1.8K [TXT] 8.2.0963 12-Jun-2020 20:20 5.2K [TXT] 8.2.0964 12-Jun-2020 22:09 4.0K [TXT] 8.2.0965 12-Jun-2020 22:16 2.0K [TXT] 8.2.0966 12-Jun-2020 22:31 4.9K [TXT] 8.2.0967 12-Jun-2020 23:00 30K [TXT] 8.2.0968 13-Jun-2020 13:21 21K [TXT] 8.2.0969 13-Jun-2020 15:14 5.7K [TXT] 8.2.0970 13-Jun-2020 15:48 16K [TXT] 8.2.0971 13-Jun-2020 16:40 1.9K [   ] 8.2.0972 13-Jun-2020 18:10 6.4K [TXT] 8.2.0973 13-Jun-2020 19:01 5.9K [TXT] 8.2.0974 13-Jun-2020 19:57 1.4K [TXT] 8.2.0975 14-Jun-2020 12:51 3.1K [   ] 8.2.0976 14-Jun-2020 13:52 15K [TXT] 8.2.0977 14-Jun-2020 14:35 4.1K [TXT] 8.2.0978 14-Jun-2020 15:37 1.8K [TXT] 8.2.0979 14-Jun-2020 16:44 2.1K [   ] 8.2.0980 14-Jun-2020 20:05 2.4K [TXT] 8.2.0981 14-Jun-2020 23:05 47K [TXT] 8.2.0982 15-Jun-2020 19:52 10K [   ] 8.2.0983 15-Jun-2020 20:26 2.7K [TXT] 8.2.0984 15-Jun-2020 21:20 3.4K [   ] 8.2.0985 15-Jun-2020 21:45 3.5K [   ] 8.2.0986 15-Jun-2020 23:19 2.0K [TXT] 8.2.0987 16-Jun-2020 11:36 12K [TXT] 8.2.0988 16-Jun-2020 20:04 32K [   ] 8.2.0989 16-Jun-2020 20:59 2.7K [TXT] 8.2.0990 16-Jun-2020 22:28 2.7K [TXT] 8.2.0991 16-Jun-2020 22:42 3.9K [TXT] 8.2.0992 16-Jun-2020 23:21 5.5K [   ] 8.2.0993 17-Jun-2020 12:05 2.3K [   ] 8.2.0994 17-Jun-2020 20:04 2.4K [TXT] 8.2.0995 17-Jun-2020 20:31 2.0K [TXT] 8.2.0996 17-Jun-2020 21:42 2.9K [TXT] 8.2.0997 17-Jun-2020 21:48 7.3K [   ] 8.2.0998 17-Jun-2020 22:59 3.4K [TXT] 8.2.0999 18-Jun-2020 17:30 2.8K [TXT] 8.2.1000 18-Jun-2020 17:30 2.8K [TXT] 8.2.1001 18-Jun-2020 18:27 5.6K [TXT] 8.2.1002 18-Jun-2020 18:35 1.9K [TXT] 8.2.1003 18-Jun-2020 18:46 2.8K [TXT] 8.2.1004 18-Jun-2020 19:16 8.5K [TXT] 8.2.1005 18-Jun-2020 19:31 12K [TXT] 8.2.1006 18-Jun-2020 20:52 13K [   ] 8.2.1007 18-Jun-2020 21:15 2.3K [   ] 8.2.1008 18-Jun-2020 22:44 2.4K [   ] 8.2.1009 18-Jun-2020 22:44 2.9K [   ] 8.2.1010 19-Jun-2020 17:22 1.8K [   ] 8.2.1011 19-Jun-2020 18:35 6.8K [   ] 8.2.1012 19-Jun-2020 19:02 3.7K [TXT] 8.2.1013 19-Jun-2020 19:11 4.1K [TXT] 8.2.1014 19-Jun-2020 19:31 5.3K [TXT] 8.2.1015 19-Jun-2020 21:47 4.6K [TXT] 8.2.1016 19-Jun-2020 22:36 1.5K [TXT] 8.2.1017 19-Jun-2020 22:38 2.9K [TXT] 8.2.1018 20-Jun-2020 13:30 4.7K [TXT] 8.2.1019 20-Jun-2020 14:44 5.2K [TXT] 8.2.1020 20-Jun-2020 15:04 1.6K [   ] 8.2.1021 20-Jun-2020 16:02 2.3K [   ] 8.2.1022 20-Jun-2020 16:06 20K [TXT] 8.2.1023 20-Jun-2020 18:20 18K [   ] 8.2.1024 20-Jun-2020 22:51 7.4K [TXT] 8.2.1025 21-Jun-2020 13:24 4.8K [TXT] 8.2.1026 21-Jun-2020 14:13 4.5K [   ] 8.2.1027 21-Jun-2020 15:10 2.9K [TXT] 8.2.1028 21-Jun-2020 15:53 10K [TXT] 8.2.1029 21-Jun-2020 16:59 9.4K [TXT] 8.2.1030 21-Jun-2020 17:58 3.4K [TXT] 8.2.1031 21-Jun-2020 20:07 2.2K [TXT] 8.2.1032 21-Jun-2020 20:39 3.1K [TXT] 8.2.1033 21-Jun-2020 20:40 2.2K [   ] 8.2.1034 21-Jun-2020 22:18 1.8K [TXT] 8.2.1035 22-Jun-2020 19:11 6.1K [   ] 8.2.1036 22-Jun-2020 19:25 1.8K [   ] 8.2.1037 22-Jun-2020 19:40 2.4K [   ] 8.2.1038 22-Jun-2020 22:10 1.8K [TXT] 8.2.1039 22-Jun-2020 20:31 2.5K [   ] 8.2.1040 22-Jun-2020 22:10 24K [TXT] 8.2.1041 22-Jun-2020 22:10 2.1K [TXT] 8.2.1042 22-Jun-2020 23:04 9.7K [   ] 8.2.1043 23-Jun-2020 20:01 1.8K [   ] 8.2.1044 23-Jun-2020 21:02 4.4K [TXT] 8.2.1045 23-Jun-2020 22:27 16K [   ] 8.2.1046 24-Jun-2020 13:39 22K [TXT] 8.2.1047 24-Jun-2020 18:38 40K [TXT] 8.2.1048 24-Jun-2020 19:06 1.3K [TXT] 8.2.1049 24-Jun-2020 20:34 27K [TXT] 8.2.1050 24-Jun-2020 21:01 1.8K [TXT] 8.2.1051 24-Jun-2020 22:08 3.0K [   ] 8.2.1052 24-Jun-2020 23:03 1.6K [   ] 8.2.1053 25-Jun-2020 19:02 5.1K [   ] 8.2.1054 25-Jun-2020 19:28 12K [   ] 8.2.1055 25-Jun-2020 19:54 3.3K [   ] 8.2.1056 25-Jun-2020 20:08 11K [TXT] 8.2.1057 25-Jun-2020 21:31 2.4K [   ] 8.2.1058 25-Jun-2020 22:24 3.1K [TXT] 8.2.1059 26-Jun-2020 19:44 3.7K [   ] 8.2.1060 26-Jun-2020 20:42 2.5K [   ] 8.2.1061 26-Jun-2020 20:42 13K [TXT] 8.2.1062 26-Jun-2020 21:29 3.5K [   ] 8.2.1063 26-Jun-2020 21:39 4.8K [   ] 8.2.1064 26-Jun-2020 22:01 3.1K [TXT] 8.2.1065 26-Jun-2020 22:47 10K [TXT] 8.2.1066 27-Jun-2020 12:33 6.2K [   ] 8.2.1067 27-Jun-2020 13:12 9.2K [   ] 8.2.1068 27-Jun-2020 14:12 8.7K [TXT] 8.2.1069 27-Jun-2020 16:36 2.0K [TXT] 8.2.1070 27-Jun-2020 17:04 1.3K [   ] 8.2.1071 27-Jun-2020 18:07 23K [   ] 8.2.1072 27-Jun-2020 18:14 2.6K [   ] 8.2.1073 27-Jun-2020 20:47 2.9K [TXT] 8.2.1074 27-Jun-2020 21:18 13K [   ] 8.2.1075 27-Jun-2020 21:56 2.1K [   ] 8.2.1076 27-Jun-2020 23:08 6.2K [TXT] 8.2.1077 28-Jun-2020 13:11 8.7K [   ] 8.2.1078 28-Jun-2020 15:52 76K [   ] 8.2.1079 28-Jun-2020 15:52 14K [TXT] 8.2.1080 28-Jun-2020 18:44 13K [TXT] 8.2.1081 28-Jun-2020 22:42 5.3K [   ] 8.2.1082 29-Jun-2020 19:56 2.6K [TXT] 8.2.1083 29-Jun-2020 20:10 3.4K [   ] 8.2.1084 29-Jun-2020 20:21 2.5K [   ] 8.2.1085 29-Jun-2020 20:24 2.6K [TXT] 8.2.1086 29-Jun-2020 20:41 3.5K [TXT] 8.2.1087 29-Jun-2020 21:15 1.7K [TXT] 8.2.1088 29-Jun-2020 21:32 2.3K [   ] 8.2.1089 29-Jun-2020 22:25 2.2K [TXT] 8.2.1090 29-Jun-2020 22:32 1.6K [TXT] 8.2.1091 29-Jun-2020 22:41 1.6K [   ] 8.2.1092 29-Jun-2020 23:03 1.5K [TXT] 8.2.1093 29-Jun-2020 23:08 1.3K [   ] 8.2.1094 29-Jun-2020 23:15 1.5K [   ] 8.2.1095 29-Jun-2020 23:19 2.2K [TXT] 8.2.1096 30-Jun-2020 13:39 4.2K [   ] 8.2.1097 30-Jun-2020 18:46 3.5K [   ] 8.2.1098 30-Jun-2020 20:56 2.7K [TXT] 8.2.1099 30-Jun-2020 21:19 4.6K [TXT] 8.2.1100 30-Jun-2020 22:02 4.9K [TXT] 8.2.1101 30-Jun-2020 22:12 2.2K [TXT] 8.2.1102 01-Jul-2020 13:05 3.5K [TXT] 8.2.1103 01-Jul-2020 13:08 1.5K [TXT] 8.2.1104 01-Jul-2020 13:16 1.8K [   ] 8.2.1105 01-Jul-2020 13:53 15K [TXT] 8.2.1106 01-Jul-2020 14:39 2.9K [TXT] 8.2.1107 01-Jul-2020 15:13 4.0K [   ] 8.2.1108 01-Jul-2020 15:50 12K [   ] 8.2.1109 01-Jul-2020 16:01 1.8K [TXT] 8.2.1110 01-Jul-2020 17:29 17K [   ] 8.2.1111 01-Jul-2020 18:31 23K [   ] 8.2.1112 01-Jul-2020 20:08 6.6K [   ] 8.2.1113 01-Jul-2020 20:20 1.7K [TXT] 8.2.1114 01-Jul-2020 21:55 102K [   ] 8.2.1115 02-Jul-2020 21:00 2.0K [   ] 8.2.1116 02-Jul-2020 21:12 3.7K [TXT] 8.2.1117 02-Jul-2020 21:18 1.3K [TXT] 8.2.1118 02-Jul-2020 21:24 1.4K [   ] 8.2.1119 02-Jul-2020 22:51 2.5K [   ] 8.2.1120 03-Jul-2020 18:00 261K [   ] 8.2.1121 03-Jul-2020 18:15 2.9K [TXT] 8.2.1122 03-Jul-2020 21:10 5.0K [   ] 8.2.1123 03-Jul-2020 21:18 298K [TXT] 8.2.1124 04-Jul-2020 14:16 17K [TXT] 8.2.1125 04-Jul-2020 14:16 7.3K [TXT] 8.2.1126 04-Jul-2020 17:39 1.9K [TXT] 8.2.1127 04-Jul-2020 19:20 2.5K [TXT] 8.2.1128 05-Jul-2020 14:12 7.6K [   ] 8.2.1129 05-Jul-2020 14:59 4.3K [TXT] 8.2.1130 05-Jul-2020 15:33 2.1K [   ] 8.2.1131 05-Jul-2020 15:54 4.0K [TXT] 8.2.1132 05-Jul-2020 16:10 3.1K [TXT] 8.2.1133 05-Jul-2020 16:10 2.5K [TXT] 8.2.1134 05-Jul-2020 16:46 2.5K [TXT] 8.2.1135 05-Jul-2020 16:52 2.8K [TXT] 8.2.1136 05-Jul-2020 17:04 3.0K [TXT] 8.2.1137 05-Jul-2020 18:20 6.8K [TXT] 8.2.1138 05-Jul-2020 18:41 3.6K [   ] 8.2.1139 05-Jul-2020 18:49 2.5K [TXT] 8.2.1140 05-Jul-2020 20:09 2.5K [TXT] 8.2.1141 05-Jul-2020 20:17 2.8K [TXT] 8.2.1142 05-Jul-2020 20:47 2.7K [TXT] 8.2.1143 05-Jul-2020 20:56 3.4K [TXT] 8.2.1144 05-Jul-2020 21:11 2.5K [TXT] 8.2.1145 05-Jul-2020 21:38 4.9K [   ] 8.2.1146 06-Jul-2020 21:04 47K [TXT] 8.2.1147 06-Jul-2020 21:25 9.2K [   ] 8.2.1148 06-Jul-2020 21:55 3.1K [TXT] 8.2.1149 06-Jul-2020 23:07 3.3K [TXT] 8.2.1150 07-Jul-2020 20:13 6.1K [   ] 8.2.1151 07-Jul-2020 20:51 6.1K [TXT] 8.2.1152 07-Jul-2020 22:51 2.9K [   ] 8.2.1153 07-Jul-2020 23:33 1.8K [TXT] 8.2.1154 08-Jul-2020 15:17 9.2K [TXT] 8.2.1155 08-Jul-2020 17:37 17K [   ] 8.2.1156 08-Jul-2020 17:48 2.3K [   ] 8.2.1157 08-Jul-2020 18:35 2.8K [   ] 8.2.1158 08-Jul-2020 18:35 1.5K [   ] 8.2.1159 08-Jul-2020 18:39 3.0K [TXT] 8.2.1160 08-Jul-2020 19:36 3.1K [   ] 8.2.1161 08-Jul-2020 22:02 12K [   ] 8.2.1162 08-Jul-2020 22:24 1.9K [   ] 8.2.1163 08-Jul-2020 22:37 1.5K [TXT] 8.2.1164 08-Jul-2020 23:10 2.6K [TXT] 8.2.1165 09-Jul-2020 18:50 6.3K [TXT] 8.2.1166 09-Jul-2020 19:17 3.1K [   ] 8.2.1167 09-Jul-2020 21:21 10K [   ] 8.2.1168 09-Jul-2020 22:54 2.0K [   ] 8.2.1169 10-Jul-2020 20:03 1.7K [   ] 8.2.1170 10-Jul-2020 20:25 2.3K [TXT] 8.2.1171 10-Jul-2020 20:32 1.5K [TXT] 8.2.1172 10-Jul-2020 20:41 1.9K [TXT] 8.2.1173 10-Jul-2020 20:46 1.7K [TXT] 8.2.1174 10-Jul-2020 21:18 1.8K [TXT] 8.2.1175 10-Jul-2020 21:51 4.4K [TXT] 8.2.1176 10-Jul-2020 22:46 4.4K [TXT] 8.2.1177 11-Jul-2020 13:10 66K [   ] 8.2.1178 11-Jul-2020 13:42 2.8K [TXT] 8.2.1179 11-Jul-2020 14:08 1.4K [   ] 8.2.1180 11-Jul-2020 14:08 1.7K [   ] 8.2.1181 11-Jul-2020 14:26 3.1K [   ] 8.2.1182 11-Jul-2020 15:21 3.2K [TXT] 8.2.1183 11-Jul-2020 22:15 69K [   ] 8.2.1184 11-Jul-2020 22:26 3.4K [   ] 8.2.1185 11-Jul-2020 22:50 4.9K [TXT] 8.2.1186 12-Jul-2020 13:48 12K [TXT] 8.2.1187 12-Jul-2020 14:10 3.6K [TXT] 8.2.1188 12-Jul-2020 14:34 2.9K [   ] 8.2.1189 12-Jul-2020 16:33 12K [TXT] 8.2.1190 12-Jul-2020 17:07 12K [   ] 8.2.1191 12-Jul-2020 17:31 2.3K [   ] 8.2.1192 12-Jul-2020 18:34 3.4K [   ] 8.2.1193 12-Jul-2020 19:24 5.4K [TXT] 8.2.1194 12-Jul-2020 19:53 2.6K [   ] 8.2.1195 12-Jul-2020 20:00 2.0K [TXT] 8.2.1196 12-Jul-2020 20:45 1.5K [   ] 8.2.1197 12-Jul-2020 20:50 2.0K [TXT] 8.2.1198 12-Jul-2020 22:07 4.6K [   ] 8.2.1199 12-Jul-2020 23:10 6.1K [   ] 8.2.1200 13-Jul-2020 18:19 2.6K [   ] 8.2.1201 13-Jul-2020 18:57 3.0K [TXT] 8.2.1202 13-Jul-2020 20:41 3.9K [TXT] 8.2.1203 13-Jul-2020 21:29 4.3K [TXT] 8.2.1204 13-Jul-2020 22:00 2.7K [TXT] 8.2.1205 13-Jul-2020 22:29 8.4K [TXT] 8.2.1206 13-Jul-2020 23:24 1.8K [TXT] 8.2.1207 14-Jul-2020 15:07 3.4K [   ] 8.2.1208 14-Jul-2020 15:49 1.5K [   ] 8.2.1209 14-Jul-2020 16:17 1.8K [TXT] 8.2.1210 14-Jul-2020 21:23 5.9K [TXT] 8.2.1211 14-Jul-2020 21:23 2.0K [TXT] 8.2.1212 14-Jul-2020 22:11 2.8K [   ] 8.2.1213 14-Jul-2020 22:11 19K [TXT] 8.2.1214 14-Jul-2020 22:25 5.0K [   ] 8.2.1215 14-Jul-2020 23:03 34K [   ] 8.2.1216 15-Jul-2020 01:38 2.9K [TXT] 8.2.1217 15-Jul-2020 12:03 4.5K [TXT] 8.2.1218 15-Jul-2020 14:25 6.2K [TXT] 8.2.1219 15-Jul-2020 17:39 5.1K [TXT] 8.2.1220 15-Jul-2020 17:39 11K [TXT] 8.2.1221 15-Jul-2020 18:28 1.4K [TXT] 8.2.1222 15-Jul-2020 18:29 1.7K [   ] 8.2.1223 15-Jul-2020 19:49 2.9K [TXT] 8.2.1224 15-Jul-2020 22:44 3.6K [   ] 8.2.1225 16-Jul-2020 22:18 6.4K [TXT] 8.2.1226 16-Jul-2020 22:31 6.0K [TXT] 8.2.1227 17-Jul-2020 20:36 59K [TXT] 8.2.1228 17-Jul-2020 20:44 11K [TXT] 8.2.1229 17-Jul-2020 20:48 2.8K [   ] 8.2.1230 17-Jul-2020 22:07 4.5K [   ] 8.2.1231 17-Jul-2020 22:17 3.5K [TXT] 8.2.1232 17-Jul-2020 22:27 2.4K [   ] 8.2.1233 17-Jul-2020 23:04 7.1K [TXT] 8.2.1234 18-Jul-2020 12:51 3.0K [TXT] 8.2.1235 18-Jul-2020 13:00 20K [TXT] 8.2.1236 18-Jul-2020 15:17 9.4K [TXT] 8.2.1237 18-Jul-2020 16:08 5.0K [   ] 8.2.1238 18-Jul-2020 18:13 7.6K [   ] 8.2.1239 18-Jul-2020 21:41 4.3K [TXT] 8.2.1240 18-Jul-2020 22:12 1.5K [TXT] 8.2.1241 18-Jul-2020 22:25 3.3K [TXT] 8.2.1242 19-Jul-2020 14:03 4.3K [TXT] 8.2.1243 19-Jul-2020 14:43 4.3K [TXT] 8.2.1244 19-Jul-2020 15:50 5.1K [   ] 8.2.1245 19-Jul-2020 16:32 2.2K [   ] 8.2.1246 19-Jul-2020 17:18 2.9K [TXT] 8.2.1247 19-Jul-2020 17:56 5.9K [TXT] 8.2.1248 19-Jul-2020 18:25 44K [   ] 8.2.1249 19-Jul-2020 18:39 2.4K [TXT] 8.2.1250 19-Jul-2020 19:52 12K [   ] 8.2.1251 19-Jul-2020 20:50 3.8K [TXT] 8.2.1252 19-Jul-2020 22:10 4.9K [   ] 8.2.1253 19-Jul-2020 23:06 1.8K [TXT] 8.2.1254 20-Jul-2020 21:22 1.5K [   ] 8.2.1255 20-Jul-2020 21:47 27K [TXT] 8.2.1256 20-Jul-2020 22:10 2.5K [TXT] 8.2.1257 20-Jul-2020 22:38 2.8K [   ] 8.2.1258 20-Jul-2020 23:11 1.6K [TXT] 8.2.1259 21-Jul-2020 19:26 2.9K [TXT] 8.2.1260 21-Jul-2020 19:45 3.5K [   ] 8.2.1261 21-Jul-2020 20:56 3.7K [   ] 8.2.1262 21-Jul-2020 21:08 84K [TXT] 8.2.1263 21-Jul-2020 21:31 5.9K [TXT] 8.2.1264 21-Jul-2020 21:49 2.0K [   ] 8.2.1265 21-Jul-2020 22:26 1.8K [TXT] 8.2.1266 21-Jul-2020 22:35 6.2K [TXT] 8.2.1267 22-Jul-2020 18:15 1.4K [TXT] 8.2.1268 22-Jul-2020 18:17 3.9K [   ] 8.2.1269 22-Jul-2020 19:12 36K [TXT] 8.2.1270 22-Jul-2020 19:30 3.0K [TXT] 8.2.1271 22-Jul-2020 20:16 2.6K [TXT] 8.2.1272 22-Jul-2020 21:45 11K [TXT] 8.2.1273 22-Jul-2020 22:24 1.6K [   ] 8.2.1274 23-Jul-2020 13:12 6.9K [TXT] 8.2.1275 23-Jul-2020 14:40 1.8K [   ] 8.2.1276 23-Jul-2020 14:51 2.6K [   ] 8.2.1277 23-Jul-2020 14:59 4.5K [   ] 8.2.1278 23-Jul-2020 15:46 4.3K [   ] 8.2.1279 23-Jul-2020 15:51 2.5K [   ] 8.2.1280 23-Jul-2020 16:37 21K [TXT] 8.2.1281 23-Jul-2020 17:17 10K [TXT] 8.2.1282 23-Jul-2020 18:27 4.0K [TXT] 8.2.1283 23-Jul-2020 19:40 2.7K [TXT] 8.2.1284 23-Jul-2020 20:10 2.1K [   ] 8.2.1285 23-Jul-2020 20:57 3.7K [TXT] 8.2.1286 23-Jul-2020 21:15 2.3K [TXT] 8.2.1287 23-Jul-2020 22:42 4.4K [TXT] 8.2.1288 24-Jul-2020 18:48 2.3K [TXT] 8.2.1289 25-Jul-2020 14:12 2.1K [TXT] 8.2.1290 25-Jul-2020 15:41 3.7K [TXT] 8.2.1291 25-Jul-2020 16:34 4.1K [   ] 8.2.1292 25-Jul-2020 16:54 1.8K [TXT] 8.2.1293 25-Jul-2020 19:40 2.9K [TXT] 8.2.1294 25-Jul-2020 19:40 99K [TXT] 8.2.1295 26-Jul-2020 12:54 11K [TXT] 8.2.1296 26-Jul-2020 13:28 2.1K [TXT] 8.2.1297 26-Jul-2020 15:37 17K [TXT] 8.2.1298 26-Jul-2020 15:51 1.4K [TXT] 8.2.1299 26-Jul-2020 15:56 2.5K [TXT] 8.2.1300 26-Jul-2020 17:57 6.8K [TXT] 8.2.1301 26-Jul-2020 18:17 2.0K [TXT] 8.2.1302 26-Jul-2020 18:34 2.9K [TXT] 8.2.1303 26-Jul-2020 22:21 2.9K [   ] 8.2.1304 27-Jul-2020 19:48 17K [TXT] 8.2.1305 27-Jul-2020 20:03 20K [   ] 8.2.1306 27-Jul-2020 21:44 7.3K [   ] 8.2.1307 27-Jul-2020 22:41 5.8K [TXT] 8.2.1308 28-Jul-2020 20:08 15K [TXT] 8.2.1309 28-Jul-2020 20:26 2.3K [TXT] 8.2.1310 28-Jul-2020 21:27 2.2K [   ] 8.2.1311 28-Jul-2020 21:27 1.7K [   ] 8.2.1312 28-Jul-2020 21:41 2.3K [   ] 8.2.1313 28-Jul-2020 22:39 9.0K [TXT] 8.2.1314 29-Jul-2020 14:41 2.7K [   ] 8.2.1315 29-Jul-2020 15:04 3.1K [TXT] 8.2.1316 29-Jul-2020 16:09 12K [   ] 8.2.1317 29-Jul-2020 16:35 13K [   ] 8.2.1318 29-Jul-2020 17:35 1.7K [TXT] 8.2.1319 29-Jul-2020 17:44 2.9K [   ] 8.2.1320 29-Jul-2020 19:18 4.9K [TXT] 8.2.1321 29-Jul-2020 19:30 1.3K [TXT] 8.2.1322 29-Jul-2020 20:01 3.5K [TXT] 8.2.1323 29-Jul-2020 21:21 5.1K [   ] 8.2.1324 29-Jul-2020 21:38 2.9K [TXT] 8.2.1325 29-Jul-2020 22:11 3.2K [   ] 8.2.1326 30-Jul-2020 20:10 14K [TXT] 8.2.1327 30-Jul-2020 20:18 5.0K [TXT] 8.2.1328 30-Jul-2020 22:18 3.4K [TXT] 8.2.1329 31-Jul-2020 22:05 15K [   ] 8.2.1330 31-Jul-2020 22:18 3.1K [   ] 8.2.1331 31-Jul-2020 22:38 2.1K [TXT] 8.2.1332 31-Jul-2020 23:47 6.8K [TXT] 8.2.1333 01-Aug-2020 00:03 3.7K [   ] 8.2.1334 01-Aug-2020 12:27 2.3K [TXT] 8.2.1335 01-Aug-2020 13:10 4.4K [   ] 8.2.1336 01-Aug-2020 13:23 1.5K [   ] 8.2.1337 01-Aug-2020 14:08 2.5K [TXT] 8.2.1338 01-Aug-2020 15:39 5.9K [   ] 8.2.1339 01-Aug-2020 15:53 3.1K [   ] 8.2.1340 01-Aug-2020 16:09 13K [TXT] 8.2.1341 01-Aug-2020 16:36 1.7K [   ] 8.2.1342 01-Aug-2020 17:00 5.7K [TXT] 8.2.1343 01-Aug-2020 18:54 5.9K [   ] 8.2.1344 01-Aug-2020 18:58 1.6K [TXT] 8.2.1345 01-Aug-2020 19:15 3.4K [   ] 8.2.1346 01-Aug-2020 19:24 1.5K [TXT] 8.2.1347 01-Aug-2020 20:46 5.0K [TXT] 8.2.1348 01-Aug-2020 21:12 1.5K [TXT] 8.2.1349 01-Aug-2020 22:17 7.4K [   ] 8.2.1350 01-Aug-2020 22:24 1.6K [   ] 8.2.1351 01-Aug-2020 22:37 2.6K [   ] 8.2.1352 01-Aug-2020 23:23 2.8K [   ] 8.2.1353 02-Aug-2020 15:05 2.6K [TXT] 8.2.1354 02-Aug-2020 16:11 50K [   ] 8.2.1355 02-Aug-2020 17:00 8.2K [TXT] 8.2.1356 02-Aug-2020 17:34 2.1K [   ] 8.2.1357 02-Aug-2020 19:00 4.5K [   ] 8.2.1358 02-Aug-2020 20:04 2.1K [TXT] 8.2.1359 02-Aug-2020 20:41 3.0K [   ] 8.2.1360 03-Aug-2020 22:41 2.1K [TXT] 8.2.1361 04-Aug-2020 15:53 1.7K [TXT] 8.2.1362 04-Aug-2020 20:18 2.6K [   ] 8.2.1363 04-Aug-2020 21:05 1.6K [   ] 8.2.1364 04-Aug-2020 21:47 1.7K [   ] 8.2.1365 05-Aug-2020 10:54 9.4K [TXT] 8.2.1366 05-Aug-2020 11:21 101K [   ] 8.2.1367 05-Aug-2020 11:52 5.0K [TXT] 8.2.1368 05-Aug-2020 11:52 5.2K [TXT] 8.2.1369 05-Aug-2020 12:03 1.6K [TXT] 8.2.1370 05-Aug-2020 12:11 1.8K [TXT] 8.2.1371 05-Aug-2020 12:33 3.7K [TXT] 8.2.1372 05-Aug-2020 12:46 5.2K [TXT] 8.2.1373 05-Aug-2020 14:34 7.0K [TXT] 8.2.1374 05-Aug-2020 15:11 3.2K [   ] 8.2.1375 05-Aug-2020 15:44 2.3K [   ] 8.2.1376 05-Aug-2020 16:20 3.4K [TXT] 8.2.1377 05-Aug-2020 22:08 1.4K [   ] 8.2.1378 06-Aug-2020 11:24 2.7K [   ] 8.2.1379 06-Aug-2020 16:39 2.4K [TXT] 8.2.1380 06-Aug-2020 21:27 3.0K [TXT] 8.2.1381 06-Aug-2020 21:49 4.5K [TXT] 8.2.1382 06-Aug-2020 22:25 3.0K [   ] 8.2.1383 07-Aug-2020 16:49 61K [TXT] 8.2.1384 07-Aug-2020 18:13 3.7K [   ] 8.2.1385 07-Aug-2020 18:34 6.5K [   ] 8.2.1386 07-Aug-2020 19:28 3.1K [TXT] 8.2.1387 07-Aug-2020 19:28 2.6K [   ] 8.2.1388 07-Aug-2020 20:47 7.7K [TXT] 8.2.1389 07-Aug-2020 20:48 1.4K [TXT] 8.2.1390 07-Aug-2020 21:29 2.1K [   ] 8.2.1391 07-Aug-2020 22:01 2.0K [TXT] 8.2.1392 08-Aug-2020 14:27 3.1K [TXT] 8.2.1393 08-Aug-2020 14:42 13K [   ] 8.2.1394 08-Aug-2020 15:11 4.4K [TXT] 8.2.1395 08-Aug-2020 15:46 7.3K [TXT] 8.2.1396 08-Aug-2020 16:48 7.0K [TXT] 8.2.1397 08-Aug-2020 17:57 2.9K [TXT] 8.2.1398 08-Aug-2020 21:34 2.3K [TXT] 8.2.1399 08-Aug-2020 22:16 5.5K [   ] 8.2.1400 09-Aug-2020 13:03 3.2K [TXT] 8.2.1401 09-Aug-2020 14:05 13K [   ] 8.2.1402 09-Aug-2020 14:08 1.7K [TXT] 8.2.1403 09-Aug-2020 14:34 4.1K [TXT] 8.2.1404 09-Aug-2020 14:44 3.4K [   ] 8.2.1405 09-Aug-2020 15:25 52K [TXT] 8.2.1406 09-Aug-2020 16:38 7.7K [TXT] 8.2.1407 09-Aug-2020 17:22 15K [TXT] 8.2.1408 09-Aug-2020 19:04 6.2K [   ] 8.2.1409 09-Aug-2020 19:33 6.9K [TXT] 8.2.1410 09-Aug-2020 20:06 3.2K [   ] 8.2.1411 09-Aug-2020 21:47 1.9K [   ] 8.2.1412 09-Aug-2020 22:18 3.7K [TXT] 8.2.1413 10-Aug-2020 19:22 5.8K [TXT] 8.2.1414 10-Aug-2020 20:40 10K [TXT] 8.2.1415 10-Aug-2020 21:20 3.2K [   ] 8.2.1416 10-Aug-2020 21:58 5.1K [   ] 8.2.1417 10-Aug-2020 22:16 120K [   ] 8.2.1418 10-Aug-2020 22:41 2.5K [TXT] 8.2.1419 10-Aug-2020 23:10 7.5K [   ] 8.2.1420 11-Aug-2020 20:43 81K [TXT] 8.2.1421 11-Aug-2020 20:57 2.0K [TXT] 8.2.1422 11-Aug-2020 21:59 225K [TXT] 8.2.1423 11-Aug-2020 22:31 2.3K [   ] 8.2.1424 11-Aug-2020 23:09 5.2K [TXT] 8.2.1425 12-Aug-2020 14:22 2.1K [TXT] 8.2.1426 12-Aug-2020 15:22 5.7K [   ] 8.2.1427 12-Aug-2020 15:49 3.5K [   ] 8.2.1428 12-Aug-2020 16:39 3.3K [TXT] 8.2.1429 12-Aug-2020 17:36 3.0K [   ] 8.2.1430 12-Aug-2020 18:02 4.3K [   ] 8.2.1431 12-Aug-2020 18:35 2.9K [   ] 8.2.1432 12-Aug-2020 18:51 149K [   ] 8.2.1433 12-Aug-2020 19:16 2.7K [TXT] 8.2.1434 12-Aug-2020 19:42 2.4K [TXT] 8.2.1435 12-Aug-2020 21:35 14K [TXT] 8.2.1436 12-Aug-2020 21:58 4.4K [TXT] 8.2.1437 12-Aug-2020 22:19 2.6K [TXT] 8.2.1438 12-Aug-2020 22:23 4.4K [TXT] 8.2.1439 13-Aug-2020 19:00 53K [   ] 8.2.1440 13-Aug-2020 19:21 12K [TXT] 8.2.1441 13-Aug-2020 19:43 2.3K [TXT] 8.2.1442 13-Aug-2020 21:06 7.0K [TXT] 8.2.1443 13-Aug-2020 21:40 2.2K [   ] 8.2.1444 13-Aug-2020 22:49 149K [TXT] 8.2.1445 14-Aug-2020 17:09 2.8K [   ] 8.2.1446 14-Aug-2020 18:36 7.6K [   ] 8.2.1447 14-Aug-2020 19:00 2.5K [TXT] 8.2.1448 14-Aug-2020 19:11 1.6K [TXT] 8.2.1449 14-Aug-2020 19:21 3.7K [   ] 8.2.1450 14-Aug-2020 20:53 2.1K [TXT] 8.2.1451 14-Aug-2020 21:28 4.5K [   ] 8.2.1452 14-Aug-2020 21:43 1.6K [TXT] 8.2.1453 14-Aug-2020 21:49 1.5K [   ] 8.2.1454 14-Aug-2020 22:17 2.9K [   ] 8.2.1455 14-Aug-2020 22:45 2.6K [TXT] 8.2.1456 14-Aug-2020 23:09 2.4K [TXT] 8.2.1457 15-Aug-2020 13:50 1.4K [   ] 8.2.1458 15-Aug-2020 14:11 2.8K [TXT] 8.2.1459 15-Aug-2020 14:32 2.7K [TXT] 8.2.1460 15-Aug-2020 16:34 78K [TXT] 8.2.1461 15-Aug-2020 18:39 9.9K [TXT] 8.2.1462 15-Aug-2020 21:11 15K [   ] 8.2.1463 15-Aug-2020 22:15 12K [TXT] 8.2.1464 15-Aug-2020 22:49 1.4K [TXT] 8.2.1465 16-Aug-2020 14:49 14K [TXT] 8.2.1466 16-Aug-2020 17:34 30K [   ] 8.2.1467 16-Aug-2020 18:30 4.1K [TXT] 8.2.1468 16-Aug-2020 18:43 1.9K [TXT] 8.2.1469 16-Aug-2020 21:29 6.2K [   ] 8.2.1470 16-Aug-2020 21:52 7.0K [TXT] 8.2.1471 16-Aug-2020 22:51 2.8K [TXT] 8.2.1472 17-Aug-2020 19:35 3.6K [TXT] 8.2.1473 17-Aug-2020 21:18 9.9K [   ] 8.2.1474 17-Aug-2020 21:18 3.4K [TXT] 8.2.1475 17-Aug-2020 21:45 7.2K [   ] 8.2.1476 17-Aug-2020 21:57 1.8K [   ] 8.2.1477 17-Aug-2020 22:22 2.1K [TXT] 8.2.1478 18-Aug-2020 13:10 5.4K [TXT] 8.2.1479 18-Aug-2020 14:11 11K [   ] 8.2.1480 18-Aug-2020 19:12 3.0K [   ] 8.2.1481 18-Aug-2020 20:35 57K [TXT] 8.2.1482 18-Aug-2020 22:33 3.7K [   ] 8.2.1483 18-Aug-2020 22:51 1.7K [   ] 8.2.1484 18-Aug-2020 23:32 1.7K [   ] 8.2.1485 19-Aug-2020 14:59 2.1K [TXT] 8.2.1486 19-Aug-2020 16:00 5.4K [   ] 8.2.1487 19-Aug-2020 19:47 3.1K [TXT] 8.2.1488 19-Aug-2020 20:20 2.9K [TXT] 8.2.1489 19-Aug-2020 21:21 4.4K [TXT] 8.2.1490 19-Aug-2020 22:03 4.3K [   ] 8.2.1491 20-Aug-2020 15:03 22K [   ] 8.2.1492 20-Aug-2020 15:25 7.1K [TXT] 8.2.1493 20-Aug-2020 15:42 18K [   ] 8.2.1494 20-Aug-2020 16:17 1.7K [   ] 8.2.1495 20-Aug-2020 16:17 1.9K [TXT] 8.2.1496 20-Aug-2020 18:04 2.3K [   ] 8.2.1497 20-Aug-2020 18:48 2.4K [   ] 8.2.1498 20-Aug-2020 18:59 17K [TXT] 8.2.1499 20-Aug-2020 22:30 3.0K [TXT] 8.2.1500 20-Aug-2020 23:05 2.8K [TXT] 8.2.1501 21-Aug-2020 20:44 2.9K [   ] 8.2.1502 21-Aug-2020 21:34 3.4K [TXT] 8.2.1503 21-Aug-2020 21:56 2.5K [TXT] 8.2.1504 21-Aug-2020 22:38 19K [   ] 8.2.1505 21-Aug-2020 22:47 4.7K [TXT] 8.2.1506 22-Aug-2020 15:20 4.2K [   ] 8.2.1507 22-Aug-2020 15:20 3.3K [TXT] 8.2.1508 22-Aug-2020 16:06 5.0K [TXT] 8.2.1509 22-Aug-2020 17:22 1.9K [TXT] 8.2.1510 22-Aug-2020 19:02 7.7K [TXT] 8.2.1511 22-Aug-2020 21:09 3.3K [TXT] 8.2.1512 22-Aug-2020 22:38 4.2K [   ] 8.2.1513 23-Aug-2020 14:29 13K [TXT] 8.2.1514 23-Aug-2020 15:10 2.1K [TXT] 8.2.1515 23-Aug-2020 15:25 2.9K [   ] 8.2.1516 23-Aug-2020 16:29 2.5K [TXT] 8.2.1517 23-Aug-2020 17:35 6.7K [TXT] 8.2.1518 23-Aug-2020 19:35 6.8K [   ] 8.2.1519 23-Aug-2020 21:06 9.1K [   ] 8.2.1520 23-Aug-2020 21:47 2.3K [TXT] 8.2.1521 24-Aug-2020 20:06 5.3K [TXT] 8.2.1522 24-Aug-2020 20:29 12K [TXT] 8.2.1523 25-Aug-2020 21:20 19K [TXT] 8.2.1524 25-Aug-2020 22:57 4.1K [TXT] 8.2.1525 26-Aug-2020 22:31 3.7K [TXT] 8.2.1526 27-Aug-2020 21:34 1.8K [   ] 8.2.1527 27-Aug-2020 21:34 4.2K [TXT] 8.2.1528 27-Aug-2020 22:43 4.5K [TXT] 8.2.1529 27-Aug-2020 23:09 2.7K [   ] 8.2.1530 27-Aug-2020 23:38 1.7K [   ] 8.2.1531 27-Aug-2020 23:58 1.6K [   ] 8.2.1532 28-Aug-2020 16:39 1.8K [   ] 8.2.1533 28-Aug-2020 16:51 2.0K [TXT] 8.2.1534 28-Aug-2020 17:19 4.4K [   ] 8.2.1535 28-Aug-2020 21:05 15K [TXT] 8.2.1536 28-Aug-2020 22:25 8.8K [   ] 8.2.1537 28-Aug-2020 23:28 4.6K [TXT] 8.2.1538 29-Aug-2020 12:58 6.3K [TXT] 8.2.1539 29-Aug-2020 13:41 10K [TXT] 8.2.1540 29-Aug-2020 16:42 2.8K [   ] 8.2.1541 29-Aug-2020 17:47 4.2K [TXT] 8.2.1542 29-Aug-2020 23:00 1.5K [TXT] 8.2.1543 30-Aug-2020 12:55 2.2K [TXT] 8.2.1544 30-Aug-2020 15:53 15K [TXT] 8.2.1545 30-Aug-2020 18:15 2.5K [TXT] 8.2.1546 30-Aug-2020 18:15 5.0K [   ] 8.2.1547 30-Aug-2020 19:27 7.8K [TXT] 8.2.1548 30-Aug-2020 19:42 1.4K [TXT] 8.2.1549 30-Aug-2020 20:47 1.8K [   ] 8.2.1550 30-Aug-2020 21:27 2.6K [TXT] 8.2.1551 30-Aug-2020 23:25 14K [   ] 8.2.1552 31-Aug-2020 19:59 4.8K [TXT] 8.2.1553 31-Aug-2020 21:15 2.9K [TXT] 8.2.1554 31-Aug-2020 21:23 1.4K [TXT] 8.2.1555 31-Aug-2020 21:31 5.5K [TXT] 8.2.1556 31-Aug-2020 22:00 8.4K [   ] 8.2.1557 31-Aug-2020 22:16 2.4K [TXT] 8.2.1558 31-Aug-2020 23:19 1.4K [   ] 8.2.1559 01-Sep-2020 17:53 1.6K [   ] 8.2.1560 01-Sep-2020 19:57 6.1K [   ] 8.2.1561 01-Sep-2020 21:22 1.8K [TXT] 8.2.1562 01-Sep-2020 23:07 5.7K [   ] 8.2.1563 01-Sep-2020 23:17 2.9K [TXT] 8.2.1564 02-Sep-2020 10:26 3.7K [TXT] 8.2.1565 02-Sep-2020 13:07 1.7K [   ] 8.2.1566 02-Sep-2020 17:09 2.9K [   ] 8.2.1567 02-Sep-2020 19:25 4.3K [TXT] 8.2.1568 02-Sep-2020 20:00 3.0K [   ] 8.2.1569 02-Sep-2020 21:03 2.7K [TXT] 8.2.1570 02-Sep-2020 21:22 5.9K [   ] 8.2.1571 02-Sep-2020 21:32 2.4K [   ] 8.2.1572 02-Sep-2020 21:39 2.7K [   ] 8.2.1573 02-Sep-2020 21:47 2.2K [   ] 8.2.1574 02-Sep-2020 21:54 2.7K [   ] 8.2.1575 02-Sep-2020 21:58 2.7K [   ] 8.2.1576 02-Sep-2020 22:11 2.4K [   ] 8.2.1577 02-Sep-2020 22:26 3.7K [   ] 8.2.1578 02-Sep-2020 22:35 2.8K [   ] 8.2.1579 03-Sep-2020 16:51 6.3K [   ] 8.2.1580 03-Sep-2020 16:51 8.4K [   ] 8.2.1581 03-Sep-2020 18:53 2.3K [TXT] 8.2.1582 03-Sep-2020 19:25 2.1K [TXT] 8.2.1583 03-Sep-2020 19:51 2.2K [   ] 8.2.1584 03-Sep-2020 22:34 3.6K [TXT] 8.2.1585 04-Sep-2020 13:53 12K [   ] 8.2.1586 04-Sep-2020 14:42 2.6K [TXT] 8.2.1587 04-Sep-2020 15:38 15K [TXT] 8.2.1588 04-Sep-2020 16:36 12K [TXT] 8.2.1589 04-Sep-2020 18:36 7.1K [   ] 8.2.1590 04-Sep-2020 18:36 2.2K [   ] 8.2.1591 04-Sep-2020 18:38 3.4K [   ] 8.2.1592 04-Sep-2020 19:51 2.1K [TXT] 8.2.1593 04-Sep-2020 21:19 68K [   ] 8.2.1594 05-Sep-2020 13:49 3.4K [TXT] 8.2.1595 05-Sep-2020 15:06 9.0K [   ] 8.2.1596 05-Sep-2020 15:06 1.9K [TXT] 8.2.1597 05-Sep-2020 15:57 110K [TXT] 8.2.1598 05-Sep-2020 16:09 3.0K [   ] 8.2.1599 05-Sep-2020 17:04 2.9K [   ] 8.2.1600 05-Sep-2020 17:20 2.7K [   ] 8.2.1601 05-Sep-2020 17:31 2.1K [   ] 8.2.1602 05-Sep-2020 17:37 2.8K [TXT] 8.2.1603 05-Sep-2020 17:52 2.1K [   ] 8.2.1604 05-Sep-2020 18:32 2.1K [TXT] 8.2.1605 05-Sep-2020 18:42 1.9K [   ] 8.2.1606 05-Sep-2020 18:46 1.9K [TXT] 8.2.1607 05-Sep-2020 18:49 1.3K [TXT] 8.2.1608 05-Sep-2020 20:00 1.8K [   ] 8.2.1609 05-Sep-2020 20:07 2.8K [   ] 8.2.1610 05-Sep-2020 20:18 2.6K [   ] 8.2.1611 05-Sep-2020 20:30 2.1K [   ] 8.2.1612 05-Sep-2020 20:51 3.3K [   ] 8.2.1613 05-Sep-2020 21:01 3.0K [   ] 8.2.1614 05-Sep-2020 21:22 2.8K [   ] 8.2.1615 05-Sep-2020 21:35 2.9K [   ] 8.2.1616 05-Sep-2020 21:43 2.5K [   ] 8.2.1617 05-Sep-2020 21:58 9.4K [TXT] 8.2.1618 05-Sep-2020 22:38 2.2K [   ] 8.2.1619 05-Sep-2020 22:46 2.2K [   ] 8.2.1620 05-Sep-2020 23:16 1.9K [   ] 8.2.1621 06-Sep-2020 15:15 1.9K [TXT] 8.2.1622 06-Sep-2020 15:54 25K [   ] 8.2.1623 06-Sep-2020 15:59 49K [   ] 8.2.1624 06-Sep-2020 16:09 3.3K [TXT] 8.2.1625 06-Sep-2020 17:10 2.0K [TXT] 8.2.1626 06-Sep-2020 17:14 1.7K [   ] 8.2.1627 06-Sep-2020 18:23 3.9K [   ] 8.2.1628 06-Sep-2020 18:40 2.2K [   ] 8.2.1629 06-Sep-2020 20:07 2.1K [   ] 8.2.1630 06-Sep-2020 21:13 2.1K [TXT] 8.2.1631 06-Sep-2020 21:48 15K [TXT] 8.2.1632 06-Sep-2020 22:27 15K [   ] 8.2.1633 07-Sep-2020 18:54 3.8K [TXT] 8.2.1634 07-Sep-2020 22:06 18K [TXT] 8.2.1635 08-Sep-2020 19:08 2.2K [TXT] 8.2.1636 08-Sep-2020 22:07 7.1K [   ] 8.2.1637 08-Sep-2020 22:57 12K [TXT] 8.2.1638 08-Sep-2020 22:57 3.5K [TXT] 8.2.1639 09-Sep-2020 13:03 47K [TXT] 8.2.1640 09-Sep-2020 13:03 1.3K [   ] 8.2.1641 09-Sep-2020 14:56 4.2K [TXT] 8.2.1642 09-Sep-2020 15:11 1.8K [TXT] 8.2.1643 09-Sep-2020 17:09 2.0K [TXT] 8.2.1644 09-Sep-2020 18:55 6.0K [   ] 8.2.1645 09-Sep-2020 19:06 2.4K [TXT] 8.2.1646 09-Sep-2020 19:27 1.9K [TXT] 8.2.1647 09-Sep-2020 20:04 4.7K [   ] 8.2.1648 09-Sep-2020 20:43 9.4K [   ] 8.2.1649 09-Sep-2020 20:59 4.7K [TXT] 8.2.1650 09-Sep-2020 22:28 11K [TXT] 8.2.1651 09-Sep-2020 22:44 5.5K [TXT] 8.2.1652 10-Sep-2020 14:26 11K [TXT] 8.2.1653 10-Sep-2020 21:27 12K [   ] 8.2.1654 11-Sep-2020 11:24 3.8K [   ] 8.2.1655 10-Sep-2020 21:36 2.3K [TXT] 8.2.1656 10-Sep-2020 22:06 2.0K [TXT] 8.2.1657 10-Sep-2020 22:29 2.7K [TXT] 8.2.1658 11-Sep-2020 18:00 3.4K [   ] 8.2.1659 11-Sep-2020 18:12 4.1K [TXT] 8.2.1660 11-Sep-2020 19:25 47K [TXT] 8.2.1661 11-Sep-2020 19:29 2.0K [TXT] 8.2.1662 11-Sep-2020 20:38 22K [TXT] 8.2.1663 11-Sep-2020 20:52 117K [TXT] 8.2.1664 11-Sep-2020 22:11 6.8K [   ] 8.2.1665 11-Sep-2020 22:25 16K [TXT] 8.2.1666 12-Sep-2020 14:54 7.0K [TXT] 8.2.1667 12-Sep-2020 18:33 9.8K [TXT] 8.2.1668 12-Sep-2020 19:12 2.6K [TXT] 8.2.1669 12-Sep-2020 19:52 5.7K [   ] 8.2.1670 12-Sep-2020 21:05 2.0K [   ] 8.2.1671 12-Sep-2020 21:28 2.1K [TXT] 8.2.1672 12-Sep-2020 22:10 1.4K [TXT] 8.2.1673 12-Sep-2020 22:53 2.5K [TXT] 8.2.1674 13-Sep-2020 18:58 2.2K [TXT] 8.2.1675 13-Sep-2020 21:04 1.9K [   ] 8.2.1676 13-Sep-2020 22:01 2.2K [TXT] 8.2.1677 13-Sep-2020 22:22 5.7K [TXT] 8.2.1678 13-Sep-2020 22:38 2.2K [   ] 8.2.1679 14-Sep-2020 16:38 7.3K [   ] 8.2.1680 14-Sep-2020 16:50 1.9K [TXT] 8.2.1681 14-Sep-2020 17:05 8.6K [TXT] 8.2.1682 14-Sep-2020 18:16 4.6K [   ] 8.2.1683 14-Sep-2020 18:36 2.7K [TXT] 8.2.1684 14-Sep-2020 19:12 2.8K [TXT] 8.2.1685 14-Sep-2020 21:40 49K [   ] 8.2.1686 14-Sep-2020 22:29 3.2K [   ] 8.2.1687 14-Sep-2020 22:40 1.6K [TXT] 8.2.1688 15-Sep-2020 20:34 5.0K [TXT] 8.2.1689 15-Sep-2020 20:53 4.9K [   ] 8.2.1690 15-Sep-2020 21:35 5.0K [TXT] 8.2.1691 16-Sep-2020 15:22 42K [TXT] 8.2.1692 16-Sep-2020 15:44 1.4K [TXT] 8.2.1693 16-Sep-2020 15:44 3.3K [TXT] 8.2.1694 16-Sep-2020 15:46 1.8K [   ] 8.2.1695 16-Sep-2020 17:31 2.6K [TXT] 8.2.1696 16-Sep-2020 17:31 1.5K [TXT] 8.2.1697 16-Sep-2020 17:56 36K [TXT] 8.2.1698 16-Sep-2020 21:09 24K [TXT] 8.2.1699 16-Sep-2020 21:51 1.3K [   ] 8.2.1700 16-Sep-2020 22:30 2.0K [   ] 8.2.1701 16-Sep-2020 23:24 2.6K [   ] 8.2.1702 17-Sep-2020 20:00 2.1K [TXT] 8.2.1703 17-Sep-2020 20:00 7.7K [TXT] 8.2.1704 17-Sep-2020 21:29 4.4K [TXT] 8.2.1705 18-Sep-2020 19:41 4.6K [TXT] 8.2.1706 18-Sep-2020 21:26 3.1K [   ] 8.2.1707 18-Sep-2020 21:57 2.3K [   ] 8.2.1708 18-Sep-2020 22:42 3.4K [TXT] 8.2.1709 18-Sep-2020 23:11 1.5K [TXT] 8.2.1710 19-Sep-2020 14:13 3.2K [TXT] 8.2.1711 19-Sep-2020 15:17 5.7K [   ] 8.2.1712 19-Sep-2020 18:21 5.7K [   ] 8.2.1713 20-Sep-2020 19:58 1.7K [TXT] 8.2.1714 20-Sep-2020 21:05 2.3K [TXT] 8.2.1715 20-Sep-2020 21:14 1.8K [TXT] 8.2.1716 20-Sep-2020 21:33 13K [   ] 8.2.1717 20-Sep-2020 21:44 19K [TXT] 8.2.1718 20-Sep-2020 22:04 2.8K [TXT] 8.2.1719 21-Sep-2020 20:36 2.9K [TXT] 8.2.1720 21-Sep-2020 20:36 2.6K [TXT] 8.2.1721 21-Sep-2020 21:30 1.6K [   ] 8.2.1722 21-Sep-2020 21:49 2.8K [   ] 8.2.1723 21-Sep-2020 22:03 2.0K [   ] 8.2.1724 21-Sep-2020 22:28 40K [   ] 8.2.1725 22-Sep-2020 19:16 4.2K [TXT] 8.2.1726 22-Sep-2020 20:34 41K [TXT] 8.2.1727 22-Sep-2020 21:57 9.4K [TXT] 8.2.1728 22-Sep-2020 22:09 1.4K [TXT] 8.2.1729 23-Sep-2020 12:30 5.2K [   ] 8.2.1730 23-Sep-2020 13:26 2.9K [TXT] 8.2.1731 23-Sep-2020 15:57 4.0K [TXT] 8.2.1732 23-Sep-2020 17:42 6.5K [TXT] 8.2.1733 23-Sep-2020 18:52 1.4K [TXT] 8.2.1734 23-Sep-2020 21:58 16K [   ] 8.2.1735 23-Sep-2020 22:28 1.9K [   ] 8.2.1736 23-Sep-2020 22:38 11K [TXT] 8.2.1737 24-Sep-2020 22:58 5.6K [TXT] 8.2.1738 24-Sep-2020 23:09 1.4K [TXT] 8.2.1739 25-Sep-2020 21:48 4.0K [TXT] 8.2.1740 25-Sep-2020 22:13 1.6K [TXT] 8.2.1741 25-Sep-2020 22:43 9.8K [TXT] 8.2.1742 25-Sep-2020 23:13 2.0K [TXT] 8.2.1743 25-Sep-2020 23:49 4.2K [   ] 8.2.1744 26-Sep-2020 15:10 102K [TXT] 8.2.1745 26-Sep-2020 15:21 1.3K [   ] 8.2.1746 26-Sep-2020 17:21 3.4K [   ] 8.2.1747 26-Sep-2020 18:47 2.7K [TXT] 8.2.1748 26-Sep-2020 19:12 3.1K [   ] 8.2.1749 26-Sep-2020 20:00 3.2K [TXT] 8.2.1750 26-Sep-2020 22:04 13K [   ] 8.2.1751 26-Sep-2020 22:40 4.1K [TXT] 8.2.1752 27-Sep-2020 13:20 4.8K [TXT] 8.2.1753 27-Sep-2020 13:51 1.5K [TXT] 8.2.1754 27-Sep-2020 13:59 2.6K [   ] 8.2.1755 27-Sep-2020 14:37 3.1K [   ] 8.2.1756 27-Sep-2020 15:20 63K [TXT] 8.2.1757 27-Sep-2020 16:04 3.6K [TXT] 8.2.1758 27-Sep-2020 17:46 2.8K [   ] 8.2.1759 27-Sep-2020 17:59 75K [   ] 8.2.1760 27-Sep-2020 18:24 2.3K [   ] 8.2.1761 27-Sep-2020 19:06 55K [   ] 8.2.1762 27-Sep-2020 20:13 2.9K [   ] 8.2.1763 27-Sep-2020 21:17 3.3K [   ] 8.2.1764 27-Sep-2020 21:28 2.2K [   ] 8.2.1765 27-Sep-2020 22:02 15K [TXT] 8.2.1766 27-Sep-2020 22:48 47K [   ] 8.2.1767 27-Sep-2020 23:35 1.5K [TXT] 8.2.1768 28-Sep-2020 22:30 4.9K [TXT] 8.2.1769 28-Sep-2020 22:30 7.9K [   ] 8.2.1770 28-Sep-2020 23:15 2.6K [TXT] 8.2.1771 29-Sep-2020 21:00 4.6K [TXT] 8.2.1772 29-Sep-2020 21:24 2.8K [   ] 8.2.1773 29-Sep-2020 21:46 1.7K [TXT] 8.2.1774 29-Sep-2020 22:17 1.7K [TXT] 8.2.1775 30-Sep-2020 10:16 3.7K [TXT] 8.2.1776 30-Sep-2020 22:50 2.2K [TXT] 8.2.1777 30-Sep-2020 23:00 10K [TXT] 8.2.1778 01-Oct-2020 13:02 4.9K [   ] 8.2.1779 01-Oct-2020 16:55 2.3K [TXT] 8.2.1780 01-Oct-2020 19:21 2.6K [TXT] 8.2.1781 01-Oct-2020 20:14 3.0K [   ] 8.2.1782 01-Oct-2020 21:38 2.0K [TXT] 8.2.1783 01-Oct-2020 22:40 3.7K [TXT] 8.2.1784 02-Oct-2020 10:30 3.9K [   ] 8.2.1785 02-Oct-2020 18:27 1.7K [   ] 8.2.1786 02-Oct-2020 18:48 12K [   ] 8.2.1787 02-Oct-2020 20:36 3.6K [TXT] 8.2.1788 03-Oct-2020 12:58 2.6K [TXT] 8.2.1789 03-Oct-2020 13:54 2.9K [TXT] 8.2.1790 03-Oct-2020 13:58 2.4K [TXT] 8.2.1791 03-Oct-2020 14:15 1.9K [   ] 8.2.1792 03-Oct-2020 14:25 2.9K [TXT] 8.2.1793 03-Oct-2020 17:05 4.8K [TXT] 8.2.1794 03-Oct-2020 20:18 20K [TXT] 8.2.1795 03-Oct-2020 22:53 37K [TXT] 8.2.1796 04-Oct-2020 13:44 3.4K [TXT] 8.2.1797 04-Oct-2020 14:18 2.6K [TXT] 8.2.1798 04-Oct-2020 16:06 20K [   ] 8.2.1799 04-Oct-2020 16:19 12K [TXT] 8.2.1800 04-Oct-2020 17:33 1.6K [TXT] 8.2.1801 04-Oct-2020 19:59 2.9K [   ] 8.2.1802 05-Oct-2020 19:24 1.9K [   ] 8.2.1803 05-Oct-2020 20:09 4.0K [TXT] 8.2.1804 05-Oct-2020 20:39 2.0K [   ] 8.2.1805 05-Oct-2020 21:40 2.4K [TXT] 8.2.1806 06-Oct-2020 19:59 2.4K [TXT] 8.2.1807 06-Oct-2020 20:47 2.4K [   ] 8.2.1808 07-Oct-2020 12:59 2.5K [TXT] 8.2.1809 07-Oct-2020 16:13 6.3K [   ] 8.2.1810 07-Oct-2020 16:55 6.2K [TXT] 8.2.1811 07-Oct-2020 17:30 5.1K [TXT] 8.2.1812 07-Oct-2020 19:08 3.3K [TXT] 8.2.1813 08-Oct-2020 21:18 7.6K [TXT] 8.2.1814 08-Oct-2020 21:31 1.6K [TXT] 8.2.1815 08-Oct-2020 23:22 2.9K [TXT] 8.2.1816 09-Oct-2020 10:22 3.4K [TXT] 8.2.1817 09-Oct-2020 22:05 3.6K [TXT] 8.2.1818 09-Oct-2020 23:06 1.6K [TXT] 8.2.1819 10-Oct-2020 14:13 12K [TXT] 8.2.1820 10-Oct-2020 15:06 1.5K [TXT] 8.2.1821 10-Oct-2020 15:39 3.4K [TXT] 8.2.1822 10-Oct-2020 16:43 1.8K [TXT] 8.2.1823 10-Oct-2020 16:46 2.5K [TXT] 8.2.1824 10-Oct-2020 19:07 9.5K [TXT] 8.2.1825 10-Oct-2020 20:32 2.4K [   ] 8.2.1826 10-Oct-2020 21:34 7.4K [   ] 8.2.1827 10-Oct-2020 21:51 47K [TXT] 8.2.1828 10-Oct-2020 22:27 1.6K [   ] 8.2.1829 10-Oct-2020 22:35 2.4K [TXT] 8.2.1830 10-Oct-2020 23:27 3.7K [TXT] 8.2.1831 11-Oct-2020 14:23 1.4K [   ] 8.2.1832 11-Oct-2020 14:31 2.2K [TXT] 8.2.1833 11-Oct-2020 14:59 2.2K [TXT] 8.2.1834 11-Oct-2020 18:05 4.5K [TXT] 8.2.1835 11-Oct-2020 19:56 5.8K [TXT] 8.2.1836 11-Oct-2020 20:09 3.7K [TXT] 8.2.1837 11-Oct-2020 20:44 4.2K [TXT] 8.2.1838 11-Oct-2020 21:35 5.7K [TXT] 8.2.1839 12-Oct-2020 20:32 3.2K [   ] 8.2.1840 12-Oct-2020 22:08 4.4K [TXT] 8.2.1841 13-Oct-2020 18:39 1.8K [TXT] 8.2.1842 13-Oct-2020 19:09 3.4K [   ] 8.2.1843 13-Oct-2020 21:12 2.1K [TXT] 8.2.1844 13-Oct-2020 22:16 3.7K [   ] 8.2.1845 14-Oct-2020 19:40 16K [TXT] 8.2.1846 15-Oct-2020 12:51 30K [   ] 8.2.1847 15-Oct-2020 13:58 1.4K [TXT] 8.2.1848 15-Oct-2020 19:12 2.5K [   ] 8.2.1849 15-Oct-2020 20:43 3.9K [TXT] 8.2.1850 15-Oct-2020 21:24 2.9K [   ] 8.2.1851 15-Oct-2020 21:55 3.6K [TXT] 8.2.1852 15-Oct-2020 22:30 3.6K [   ] 8.2.1853 16-Oct-2020 19:57 2.1K [   ] 8.2.1854 16-Oct-2020 20:26 2.9K [TXT] 8.2.1855 16-Oct-2020 23:17 3.9K [   ] 8.2.1856 17-Oct-2020 17:43 2.6K [   ] 8.2.1857 17-Oct-2020 18:52 2.4K [   ] 8.2.1858 17-Oct-2020 19:30 4.4K [TXT] 8.2.1859 17-Oct-2020 22:04 4.1K [TXT] 8.2.1860 17-Oct-2020 22:59 1.3K [   ] 8.2.1861 18-Oct-2020 18:04 4.2K [TXT] 8.2.1862 19-Oct-2020 11:23 1.3K [   ] 8.2.1863 19-Oct-2020 13:13 3.5K [TXT] 8.2.1864 19-Oct-2020 16:08 19K [TXT] 8.2.1865 19-Oct-2020 19:04 8.9K [TXT] 8.2.1866 19-Oct-2020 20:22 1.9K [TXT] 8.2.1867 19-Oct-2020 20:46 7.6K [   ] 8.2.1868 19-Oct-2020 21:46 2.0K [TXT] 8.2.1869 19-Oct-2020 23:02 1.3K [   ] 8.2.1870 20-Oct-2020 14:59 10K [   ] 8.2.1871 20-Oct-2020 14:59 2.6K [   ] 8.2.1872 20-Oct-2020 22:56 6.4K [   ] 8.2.1873 20-Oct-2020 23:12 2.2K [TXT] 8.2.1874 21-Oct-2020 12:20 7.0K [   ] 8.2.1875 21-Oct-2020 12:38 1.9K [TXT] 8.2.1876 21-Oct-2020 14:25 109K [   ] 8.2.1877 21-Oct-2020 14:50 4.5K [   ] 8.2.1878 21-Oct-2020 16:45 29K [TXT] 8.2.1879 21-Oct-2020 16:45 8.5K [TXT] 8.2.1880 21-Oct-2020 16:50 2.0K [   ] 8.2.1881 21-Oct-2020 17:29 4.7K [TXT] 8.2.1882 21-Oct-2020 21:02 3.4K [TXT] 8.2.1883 21-Oct-2020 21:02 20K [   ] 8.2.1884 22-Oct-2020 12:33 2.4K [   ] 8.2.1885 22-Oct-2020 12:34 1.5K [TXT] 8.2.1886 22-Oct-2020 13:45 3.3K [   ] 8.2.1887 22-Oct-2020 17:38 1.6K [   ] 8.2.1888 22-Oct-2020 18:24 2.5K [   ] 8.2.1889 22-Oct-2020 19:00 1.9K [TXT] 8.2.1890 22-Oct-2020 20:10 3.6K [   ] 8.2.1891 23-Oct-2020 12:20 6.3K [TXT] 8.2.1892 23-Oct-2020 15:41 1.8K [TXT] 8.2.1893 23-Oct-2020 16:51 30K [   ] 8.2.1894 23-Oct-2020 18:13 8.5K [TXT] 8.2.1895 23-Oct-2020 18:53 1.4K [TXT] 8.2.1896 24-Oct-2020 13:33 2.0K [TXT] 8.2.1897 24-Oct-2020 17:20 16K [TXT] 8.2.1898 24-Oct-2020 20:51 93K [TXT] 8.2.1899 24-Oct-2020 20:59 1.5K [   ] 8.2.1900 24-Oct-2020 23:09 19K [TXT] 8.2.1901 25-Oct-2020 13:23 3.6K [TXT] 8.2.1902 25-Oct-2020 15:03 2.1K [TXT] 8.2.1903 25-Oct-2020 16:19 1.7K [TXT] 8.2.1904 25-Oct-2020 17:10 6.8K [TXT] 8.2.1905 25-Oct-2020 17:56 3.4K [TXT] 8.2.1906 26-Oct-2020 18:48 2.9K [TXT] 8.2.1907 26-Oct-2020 19:23 6.6K [TXT] 8.2.1908 26-Oct-2020 20:18 3.3K [TXT] 8.2.1909 26-Oct-2020 21:06 26K [TXT] 8.2.1910 26-Oct-2020 21:40 2.2K [TXT] 8.2.1911 27-Oct-2020 09:13 1.8K [TXT] 8.2.1912 27-Oct-2020 20:00 3.0K [TXT] 8.2.1913 27-Oct-2020 20:44 2.1K [TXT] 8.2.1914 28-Oct-2020 13:54 8.3K [TXT] 8.2.1915 28-Oct-2020 14:33 2.7K [   ] 8.2.1916 28-Oct-2020 16:56 3.4K [   ] 8.2.1917 28-Oct-2020 17:23 1.6K [   ] 8.2.1918 28-Oct-2020 17:56 2.4K [   ] 8.2.1919 28-Oct-2020 20:21 16K [   ] 8.2.1920 28-Oct-2020 22:47 1.8K [TXT] 8.2.1921 29-Oct-2020 18:58 3.8K [TXT] 8.2.1922 29-Oct-2020 20:09 5.3K [TXT] 8.2.1923 29-Oct-2020 20:25 2.3K [   ] 8.2.1924 30-Oct-2020 18:33 3.3K [   ] 8.2.1925 30-Oct-2020 19:07 1.7K [   ] 8.2.1926 30-Oct-2020 19:25 2.6K [TXT] 8.2.1927 30-Oct-2020 20:50 5.0K [TXT] 8.2.1928 30-Oct-2020 21:50 2.5K [TXT] 8.2.1929 31-Oct-2020 13:06 1.9K [TXT] 8.2.1930 31-Oct-2020 16:34 3.1K [TXT] 8.2.1931 31-Oct-2020 19:34 6.5K [TXT] 8.2.1932 01-Nov-2020 13:35 4.7K [TXT] 8.2.1933 01-Nov-2020 13:59 10K [TXT] 8.2.1934 01-Nov-2020 17:06 7.0K [TXT] 8.2.1935 01-Nov-2020 17:21 3.8K [TXT] 8.2.1936 01-Nov-2020 17:45 2.9K [TXT] 8.2.1937 01-Nov-2020 20:05 2.7K [TXT] 8.2.1938 01-Nov-2020 21:57 3.4K [TXT] 8.2.1939 01-Nov-2020 21:57 2.8K [TXT] 8.2.1940 01-Nov-2020 22:16 1.5K [TXT] 8.2.1941 01-Nov-2020 22:32 1.4K [TXT] 8.2.1942 02-Nov-2020 20:08 18K [   ] 8.2.1943 02-Nov-2020 21:09 2.5K [   ] 8.2.1944 03-Nov-2020 11:54 1.7K [   ] 8.2.1945 03-Nov-2020 18:21 2.6K [TXT] 8.2.1946 03-Nov-2020 18:52 4.1K [TXT] 8.2.1947 03-Nov-2020 20:06 1.8K [TXT] 8.2.1948 04-Nov-2020 11:04 3.2K [TXT] 8.2.1949 04-Nov-2020 11:37 5.5K [   ] 8.2.1950 04-Nov-2020 12:01 3.4K [   ] 8.2.1951 04-Nov-2020 12:24 7.8K [   ] 8.2.1952 04-Nov-2020 13:39 2.9K [TXT] 8.2.1953 04-Nov-2020 15:08 7.1K [TXT] 8.2.1954 04-Nov-2020 18:03 3.4K [   ] 8.2.1955 04-Nov-2020 18:54 3.1K [TXT] 8.2.1956 05-Nov-2020 18:55 20K [   ] 8.2.1957 05-Nov-2020 19:08 8.6K [   ] 8.2.1958 05-Nov-2020 19:35 1.7K [TXT] 8.2.1959 05-Nov-2020 20:02 4.5K [TXT] 8.2.1960 05-Nov-2020 20:47 1.6K [TXT] 8.2.1961 05-Nov-2020 20:51 3.9K [TXT] 8.2.1962 06-Nov-2020 13:45 5.8K [TXT] 8.2.1963 06-Nov-2020 18:08 4.6K [   ] 8.2.1964 06-Nov-2020 18:53 2.8K [TXT] 8.2.1965 07-Nov-2020 16:59 4.8K [TXT] 8.2.1966 07-Nov-2020 16:59 8.4K [TXT] 8.2.1967 07-Nov-2020 19:26 13K [   ] 8.2.1968 08-Nov-2020 13:14 7.2K [TXT] 8.2.1969 09-Nov-2020 18:32 21K [TXT] 8.2.1970 09-Nov-2020 21:07 5.1K [TXT] 8.2.1971 10-Nov-2020 11:45 1.7K [   ] 8.2.1972 10-Nov-2020 18:24 1.8K [   ] 8.2.1973 10-Nov-2020 20:55 2.1K [TXT] 8.2.1974 10-Nov-2020 20:59 2.0K [TXT] 8.2.1975 10-Nov-2020 22:06 1.4K [   ] 8.2.1976 11-Nov-2020 20:53 2.5K [TXT] 8.2.1977 12-Nov-2020 12:09 16K [TXT] 8.2.1978 12-Nov-2020 14:22 33K [TXT] 8.2.1979 12-Nov-2020 15:13 3.5K [TXT] 8.2.1980 12-Nov-2020 20:17 56K [   ] 8.2.1981 13-Nov-2020 17:48 2.1K [TXT] 8.2.1982 14-Nov-2020 14:24 2.6K [TXT] 8.2.1983 14-Nov-2020 14:24 4.4K [TXT] 8.2.1984 14-Nov-2020 17:27 5.2K [   ] 8.2.1985 14-Nov-2020 20:22 2.8K [TXT] 8.2.1986 14-Nov-2020 20:58 2.3K [TXT] 8.2.1987 14-Nov-2020 21:06 3.3K [TXT] 8.2.1988 14-Nov-2020 21:35 2.4K [TXT] 8.2.1989 15-Nov-2020 14:10 2.4K [TXT] 8.2.1990 15-Nov-2020 20:33 7.9K [TXT] 8.2.1991 15-Nov-2020 21:07 1.6K [TXT] 8.2.1992 16-Nov-2020 18:40 1.3K [TXT] 8.2.1993 16-Nov-2020 18:40 2.2K [   ] 8.2.1994 16-Nov-2020 18:50 3.3K [TXT] 8.2.1995 16-Nov-2020 19:12 2.4K [TXT] 8.2.1996 16-Nov-2020 20:09 7.3K [TXT] 8.2.1997 16-Nov-2020 20:49 2.5K [   ] 8.2.1998 16-Nov-2020 21:03 2.0K [TXT] 8.2.1999 16-Nov-2020 21:23 1.7K [TXT] 8.2.2000 16-Nov-2020 22:12 4.3K [TXT] 8.2.2001 17-Nov-2020 18:24 7.3K [TXT] 8.2.2002 17-Nov-2020 18:51 2.9K [   ] 8.2.2003 17-Nov-2020 19:23 2.0K [   ] 8.2.2004 17-Nov-2020 19:57 1.6K [TXT] 8.2.2005 18-Nov-2020 11:35 4.2K [   ] 8.2.2006 18-Nov-2020 12:13 2.3K [TXT] 8.2.2007 18-Nov-2020 12:25 1.7K [TXT] 8.2.2008 18-Nov-2020 15:22 2.8K [TXT] 8.2.2009 18-Nov-2020 15:30 7.1K [   ] 8.2.2010 18-Nov-2020 16:36 3.6K [TXT] 8.2.2011 18-Nov-2020 16:54 3.9K [   ] 8.2.2012 18-Nov-2020 17:18 3.1K [   ] 8.2.2013 18-Nov-2020 17:39 2.6K [TXT] 8.2.2014 19-Nov-2020 18:47 2.9K [TXT] 8.2.2015 19-Nov-2020 18:54 12K [TXT] 8.2.2016 19-Nov-2020 18:58 2.2K [TXT] 8.2.2017 19-Nov-2020 19:02 2.6K [TXT] 8.2.2018 19-Nov-2020 21:50 2.6K [TXT] 8.2.2019 20-Nov-2020 09:11 2.4K [TXT] 8.2.2020 20-Nov-2020 19:00 3.4K [TXT] 8.2.2021 20-Nov-2020 19:27 6.5K [TXT] 8.2.2022 20-Nov-2020 21:07 2.2K [TXT] 8.2.2023 21-Nov-2020 11:46 1.6K [TXT] 8.2.2024 21-Nov-2020 12:42 6.6K [TXT] 8.2.2025 21-Nov-2020 12:45 1.7K [TXT] 8.2.2026 21-Nov-2020 13:52 1.4K [TXT] 8.2.2027 21-Nov-2020 14:00 1.2K [   ] 8.2.2028 21-Nov-2020 14:17 1.5K [   ] 8.2.2029 21-Nov-2020 14:17 1.6K [TXT] 8.2.2030 21-Nov-2020 21:42 4.6K [   ] 8.2.2031 22-Nov-2020 14:24 8.9K [   ] 8.2.2032 22-Nov-2020 18:16 4.9K [TXT] 8.2.2033 22-Nov-2020 18:16 8.5K [   ] 8.2.2034 23-Nov-2020 08:32 16K [   ] 8.2.2035 23-Nov-2020 18:48 3.2K [TXT] 8.2.2036 23-Nov-2020 20:27 4.0K [TXT] 8.2.2037 23-Nov-2020 21:26 3.0K [TXT] 8.2.2038 23-Nov-2020 21:39 1.6K [TXT] 8.2.2039 23-Nov-2020 22:02 3.0K [TXT] 8.2.2040 24-Nov-2020 19:37 2.7K [   ] 8.2.2041 24-Nov-2020 20:16 3.5K [   ] 8.2.2042 25-Nov-2020 12:26 2.0K [   ] 8.2.2043 25-Nov-2020 12:26 1.9K [TXT] 8.2.2044 25-Nov-2020 12:44 4.1K [   ] 8.2.2045 25-Nov-2020 13:50 5.2K [   ] 8.2.2046 25-Nov-2020 14:16 5.5K [TXT] 8.2.2047 25-Nov-2020 15:46 1.6K [TXT] 8.2.2048 25-Nov-2020 15:53 1.6K [TXT] 8.2.2049 25-Nov-2020 17:02 1.8K [TXT] 8.2.2050 25-Nov-2020 17:43 3.1K [TXT] 8.2.2051 25-Nov-2020 19:20 3.8K [TXT] 8.2.2052 25-Nov-2020 20:12 8.4K [TXT] 8.2.2053 25-Nov-2020 21:30 2.3K [   ] 8.2.2054 25-Nov-2020 21:56 1.9K [TXT] 8.2.2055 26-Nov-2020 19:48 2.5K [TXT] 8.2.2056 26-Nov-2020 20:12 2.5K [TXT] 8.2.2057 26-Nov-2020 20:35 4.7K [TXT] 8.2.2058 27-Nov-2020 11:02 5.2K [TXT] 8.2.2059 27-Nov-2020 19:02 2.8K [TXT] 8.2.2060 27-Nov-2020 19:14 5.1K [TXT] 8.2.2061 27-Nov-2020 20:55 3.1K [   ] 8.2.2062 28-Nov-2020 14:44 2.1K [TXT] 8.2.2063 28-Nov-2020 18:53 11K [TXT] 8.2.2064 28-Nov-2020 20:22 5.0K [TXT] 8.2.2065 28-Nov-2020 20:33 5.7K [TXT] 8.2.2066 28-Nov-2020 21:57 3.7K [TXT] 8.2.2067 28-Nov-2020 21:57 3.1K [TXT] 8.2.2068 29-Nov-2020 14:21 5.4K [TXT] 8.2.2069 29-Nov-2020 14:21 5.1K [TXT] 8.2.2070 30-Nov-2020 17:43 6.4K [   ] 8.2.2071 30-Nov-2020 21:13 3.5K [   ] 8.2.2072 30-Nov-2020 21:40 3.5K [TXT] 8.2.2073 01-Dec-2020 20:13 22K [   ] 8.2.2074 01-Dec-2020 20:13 3.4K [   ] 8.2.2075 01-Dec-2020 21:08 3.2K [TXT] 8.2.2076 01-Dec-2020 21:28 2.7K [   ] 8.2.2077 01-Dec-2020 21:48 3.2K [   ] 8.2.2078 02-Dec-2020 12:38 2.4K [   ] 8.2.2079 02-Dec-2020 13:24 2.8K [   ] 8.2.2080 02-Dec-2020 14:25 2.3K [TXT] 8.2.2081 02-Dec-2020 15:12 3.5K [TXT] 8.2.2082 02-Dec-2020 18:38 66K [TXT] 8.2.2083 02-Dec-2020 20:53 3.3K [   ] MD5SUMS 02-Dec-2020 20:53 87K [TXT] README 02-Dec-2020 20:53 126K

NLUUG - Open Systems. Open Standards
Become a member and get discounts on conferences and more, see the NLUUG website!